program: Orca
programVersion: 5.0.2
elementType: Cl S O N C C C C C C C C C C C C H H H H H H H H H H H H H H H H
charge: 0
multiplicity: 1
keywords: wb97x-d3
keywords: def2-TZVPP
keywords: def2/J RIJCOSX
keywords: DEFGRID2
keywords: scfconv7
keywords: smallprint printgap noloewdin
keywords: NOSOSCF
formula: C12H16ClNOS
InChI: InChI=1/C12H16ClNOS/c1-3-14(4-2)12(15)16-9-10-5-7-11(13)8-6-10/h5-8H,3-4,9H2,1-2H3
32 atoms
Cl 4.601173 -0.919275 1.528185
S  -1.366382 0.403945 -1.738528
O  -1.959361 1.535148 0.574457
N  -3.384691 -0.093634 -0.074992
C  -4.15942 0.066085 1.15011
C  -3.739725 -1.156113 -0.998707
C  -2.294646 0.690264 -0.224321
C  -3.548737 -0.603148 2.37209
C  -3.067274 -2.490025 -0.709343
C  0.018315 1.554011 -1.469841
C  1.157769 0.943202 -0.71328
C  2.142036 0.225822 -1.385341
C  1.259767 1.075466 0.667925
C  3.202699 -0.350553 -0.707017
C  2.315268 0.504482 1.360959
C  3.281039 -0.207161 0.668799
H  -4.292257 1.13042 1.343882
H  -5.15178 -0.343438 0.955341
H  -4.824595 -1.267963 -0.960526
H  -3.520419 -0.838368 -2.020098
H  -4.186795 -0.441161 3.241562
H  -3.441868 -1.678791 2.235846
H  -2.568833 -0.186741 2.596712
H  -3.359183 -3.2278 -1.457118
H  -1.982417 -2.395873 -0.737009
H  -3.35168 -2.879154 0.267696
H  -0.370676 2.442659 -0.975982
H  0.33061 1.842871 -2.474077
H  2.08407 0.112083 -2.461347
H  0.502961 1.625118 1.21028
H  3.962992 -0.902155 -1.242355
H  2.386766 0.615086 2.434175
totalener: -1455.38163072 hartree
nucrepener: 1310.21626224 hartree
electener: -2765.59789296 hartree
oneelecener: -4598.98122852 hartree
twoeener: 1833.38333556 hartree
kineticenergy: 1451.36874331 hartree
xcener: -99.506554861680 hartree
chargesum: -0.0000000
charge: -0.083910 -0.112456 -0.436292 -0.142704 -0.026664 -0.070689 0.309907 -0.245436 -0.228409 -0.101759 0.047094 -0.192256 -0.158232 -0.109964 -0.118016 0.070249 0.095121 0.074453 0.081397 0.093910 0.086395 0.071279 0.099666 0.085487 0.087926 0.079567 0.131161 0.128484 0.107291 0.139196 0.118233 0.119975
qa: -0.0839 -0.1125 -0.4363 -0.1427 -0.0267 -0.0707 0.3099 -0.2454 -0.2284 -0.1018 0.0471 -0.1923 -0.1582 -0.1100 -0.1180 0.0702 0.0951 0.0745 0.0814 0.0939 0.0864 0.0713 0.0997 0.0855 0.0879 0.0796 0.1312 0.1285 0.1073 0.1392 0.1182 0.1200
va: 1.2223 2.3127 2.0608 3.1831 3.8857 3.9268 4.2527 3.9075 3.8939 3.8276 3.6385 4.0609 3.9911 3.9929 3.9996 3.9324 1.0124 1.0028 1.0031 1.0083 1.0102 1.0055 1.0127 1.0132 1.0190 1.0035 1.0305 1.0044 1.0121 1.0204 1.0121 1.0125
dispcorr: -0.014174080 hartree
energy: -1455.395804800149
dipole: -30.72967 29.53248 -1.19719 -4.76394 4.28816 -0.47579 -0.61770 0.10500 -0.51270
magnitude: 1.38654 au
magnitude: 3.52431 debye
