program: Orca
programVersion: 5.0.2
elementType: Cl S O O N C C C C C C C C C C C C C C C C H H H H H H H H H H H H H H H H H H
charge: 0
multiplicity: 1
keywords: wb97x-d3
keywords: def2-TZVPP
keywords: def2/J RIJCOSX
keywords: DEFGRID2
keywords: scfconv7
keywords: smallprint printgap noloewdin
keywords: NOSOSCF
formula: C16H18ClNO2S
InChI: InChI=1/C16H18ClNO2S/c1-11-5-4-6-12(2)16(11)18(15(19)9-17)10-14-13(20-3)7-8-21-14/h4-8H,9-10H2,1-3H3
39 atoms
Cl 3.736912 -2.58311 -0.575732
S  -2.283285 1.658946 1.11408
O  -2.427471 -2.008844 -0.004545
O  1.336811 -2.490857 1.024067
N  0.63952 -0.385938 0.569834
C  0.838397 0.855413 -0.102638
C  -0.461474 -0.441673 1.538587
C  1.493835 1.887533 0.583189
C  0.325923 1.041882 -1.389252
C  -1.753597 0.028968 0.969979
C  1.471271 -1.438709 0.422221
C  1.609151 3.126137 -0.036477
C  0.465455 2.297994 -1.976592
C  2.064526 1.682026 1.954711
C  -0.350498 -0.044366 -2.171426
C  -2.656315 -0.704623 0.246649
C  1.090575 3.333543 -1.306025
C  2.607646 -1.211626 -0.564245
C  -3.782597 0.054768 -0.184348
C  -3.702287 1.351906 0.22149
C  -3.419534 -2.716163 -0.728725
H  -0.194051 0.145184 2.420413
H  -0.562902 -1.470357 1.877707
H  2.113041 3.933274 0.480914
H  0.071513 2.459973 -2.972891
H  1.299579 1.784553 2.727346
H  2.51409 0.696503 2.075609
H  2.831471 2.425997 2.164489
H  -0.412119 -0.988356 -1.637571
H  -1.365423 0.251242 -2.44052
H  0.18451 -0.227992 -3.104854
H  1.182898 4.304446 -1.775449
H  2.222944 -1.08957 -1.576495
H  3.173213 -0.315691 -0.311459
H  -4.611321 -0.332973 -0.758796
H  -4.41991 2.137345 0.040295
H  -4.376726 -2.726856 -0.201951
H  -3.063398 -3.738998 -0.826048
H  -3.566176 -2.300659 -1.728455
elementType: Cl S O N C H
totalener: -1684.23301461 hartree
nucrepener: 2052.96743309 hartree
electener: -3737.20044770 hartree
oneelecener: -6391.31336458 hartree
twoeener: 2654.11291688 hartree
cpcmener: -0.03855059 hartree
kineticenergy: 1679.22337426 hartree
xcener: -121.104778982651 hartree
chargesum: 0.0000000
charge: -0.155597 0.035901 -0.350740 -0.522031 0.011452 0.035875 -0.075043 -0.132296 -0.106208 -0.031951 0.310382 -0.066870 -0.102362 -0.271943 -0.325592 0.206465 -0.177994 -0.075732 -0.253155 -0.165075 -0.133747 0.143828 0.112164 0.140857 0.140605 0.106212 0.109438 0.106750 0.099010 0.113924 0.130062 0.158762 0.151819 0.151972 0.155338 0.169047 0.118458 0.125109 0.112906
qa: -0.1556 0.0359 -0.3507 -0.5220 0.0115 0.0359 -0.0750 -0.1323 -0.1062 -0.0320 0.3104 -0.0669 -0.1024 -0.2719 -0.3256 0.2065 -0.1780 -0.0757 -0.2532 -0.1651 -0.1337 0.1438 0.1122 0.1409 0.1406 0.1062 0.1094 0.1068 0.0990 0.1139 0.1301 0.1588 0.1518 0.1520 0.1553 0.1690 0.1185 0.1251 0.1129
va: 1.1232 2.7615 2.0195 1.9878 2.9475 3.5094 3.7495 3.8295 3.7964 3.6396 4.1240 3.7914 3.8434 3.9397 3.9550 3.8087 3.9292 3.9941 3.9131 4.0048 3.8664 1.0001 1.0489 0.9997 0.9975 0.9949 0.9962 1.0020 1.0111 0.9930 0.9932 0.9891 1.0017 0.9997 1.0027 0.9904 0.9865 0.9938 0.9847
dispcorr: -0.024387601 hartree
energy: -1684.257402207348
dipole: -11.21162 9.42530 -1.78632 8.06203 -5.71218 2.34985 -4.62391 3.34896 -1.27495
magnitude: 3.21531 au
magnitude: 8.17268 debye
