program: Orca
programVersion: 5.0.2
elementType: Cl S O O N C C C C C C C C C C C C C C C C H H H H H H H H H H H H H H H H H H
charge: 0
multiplicity: 1
keywords: wb97x-d3
keywords: def2-TZVPP
keywords: def2/J RIJCOSX
keywords: DEFGRID2
keywords: scfconv7
keywords: smallprint printgap noloewdin
keywords: NOSOSCF
formula: C16H18ClNO2S
InChI: InChI=1/C16H18ClNO2S/c1-11-5-4-6-12(2)16(11)18(15(19)9-17)10-14-13(20-3)7-8-21-14/h4-8H,9-10H2,1-3H3
39 atoms
Cl 4.174698 -2.024218 0.425159
S  -2.1816 -1.589738 1.820408
O  -2.547307 1.035992 -0.955295
O  1.425068 -2.807638 0.073395
N  0.491929 -0.802437 -0.409796
C  0.62397 0.607119 -0.580706
C  -0.843327 -1.362156 -0.643888
C  0.509585 1.460112 0.520113
C  0.793386 1.104911 -1.881176
C  -1.865981 -0.83854 0.305076
C  1.528691 -1.606021 -0.078008
C  0.541489 2.835715 0.291006
C  0.815498 2.481349 -2.06647
C  0.359061 0.971426 1.930444
C  0.951149 0.18516 -3.055082
C  -2.625072 0.294124 0.163275
C  0.680446 3.343253 -0.987562
C  2.858127 -0.880428 0.091097
C  -3.454632 0.55856 1.293023
C  -3.304797 -0.384084 2.263479
C  -3.113733 2.331754 -0.93001
H  -0.770813 -2.446778 -0.587099
H  -1.149401 -1.129718 -1.665972
H  0.452439 3.51241 1.132881
H  0.944633 2.882068 -3.064599
H  1.074157 1.474902 2.583136
H  -0.636526 1.198956 2.316848
H  0.511282 -0.098845 2.037883
H  1.669281 -0.613544 -2.863786
H  0.007423 -0.292555 -3.328685
H  1.294717 0.735369 -3.930404
H  0.696454 4.414346 -1.145367
H  3.117045 -0.323479 -0.808983
H  2.815321 -0.17254 0.918337
H  -4.131977 1.395941 1.382005
H  -3.819672 -0.432418 3.211302
H  -2.836486 2.810533 -1.867208
H  -2.727682 2.933708 -0.103123
H  -4.2052 2.300307 -0.867185
elementType: Cl S O N C H
totalener: -1684.24276379 hartree
nucrepener: 2067.63280896 hartree
electener: -3751.87557274 hartree
oneelecener: -6420.37043870 hartree
twoeener: 2668.49486596 hartree
cpcmener: -0.03026850 hartree
kineticenergy: 1679.21069919 hartree
xcener: -121.101852129739 hartree
chargesum: 0.0000000
charge: -0.150931 0.035554 -0.337168 -0.483829 -0.004386 0.106517 -0.062103 -0.094962 -0.150410 -0.060657 0.289078 -0.134754 -0.077157 -0.327016 -0.263484 0.215646 -0.165006 -0.076484 -0.253136 -0.158933 -0.144481 0.117241 0.135873 0.134777 0.137718 0.125196 0.117188 0.094746 0.104239 0.106236 0.102519 0.153748 0.147314 0.147051 0.149951 0.164105 0.123522 0.110493 0.126183
qa: -0.1509 0.0356 -0.3372 -0.4838 -0.0044 0.1065 -0.0621 -0.0950 -0.1504 -0.0607 0.2891 -0.1348 -0.0772 -0.3270 -0.2635 0.2156 -0.1650 -0.0765 -0.2531 -0.1589 -0.1445 0.1172 0.1359 0.1348 0.1377 0.1252 0.1172 0.0947 0.1042 0.1062 0.1025 0.1537 0.1473 0.1471 0.1500 0.1641 0.1235 0.1105 0.1262
va: 1.1273 2.7555 2.0263 2.0333 2.9814 3.4777 3.7849 3.7174 3.8391 3.6098 4.1442 3.8275 3.7951 3.9601 3.9477 3.8479 3.9154 3.9944 3.9224 3.9889 3.8657 1.0442 1.0048 1.0007 1.0012 0.9987 0.9877 1.0075 0.9956 0.9963 1.0032 0.9912 1.0007 1.0033 1.0046 0.9921 0.9927 0.9846 0.9878
dispcorr: -0.025599856 hartree
energy: -1684.268363641919
dipole: -12.41930 10.70476 -1.71454 20.27149 -16.87601 3.39549 -7.18781 6.79927 -0.38853
magnitude: 3.82360 au
magnitude: 9.71883 debye
