program: Orca
programVersion: 5.0.2
elementType: Cl S O O N C C C C C C C C C C C C C C C C H H H H H H H H H H H H H H H H H H
charge: 0
multiplicity: 1
keywords: wb97x-d3
keywords: def2-TZVPP
keywords: def2/J RIJCOSX
keywords: DEFGRID2
keywords: scfconv7
keywords: smallprint printgap noloewdin
keywords: NOSOSCF
formula: C16H18ClNO2S
InChI: InChI=1/C16H18ClNO2S/c1-11-5-4-6-12(2)16(11)18(15(19)9-17)10-14-13(20-3)7-8-21-14/h4-8H,9-10H2,1-3H3
39 atoms
Cl 2.968381 -1.605436 -1.780162
S  -2.501864 -2.057584 -0.170047
O  -2.00351 1.430868 1.342626
O  1.747184 -2.699639 1.174478
N  0.737862 -0.723772 0.70086
C  0.810396 0.586599 0.145928
C  -0.452648 -1.070017 1.482766
C  1.265676 1.63367 0.959687
C  0.398055 0.818466 -1.167546
C  -1.72608 -0.831495 0.750382
C  1.780214 -1.602715 0.662962
C  1.329453 2.914331 0.430376
C  0.477404 2.120511 -1.661727
C  1.677525 1.392893 2.381993
C  -0.149469 -0.250631 -2.064292
C  -2.415413 0.347392 0.661483
C  0.939328 3.158467 -0.87737
C  3.039522 -1.141865 -0.057977
C  -3.559267 0.263948 -0.183497
C  -3.716785 -0.985723 -0.699656
C  -2.411134 2.690058 0.864081
H  -0.46148 -0.489463 2.408081
H  -0.354978 -2.114174 1.772704
H  1.692932 3.727183 1.046912
H  0.172728 2.31106 -2.683802
H  2.204465 2.256709 2.784234
H  0.808664 1.220363 3.019546
H  2.332097 0.528249 2.493684
H  0.028357 -1.254293 -1.693952
H  -1.228101 -0.127684 -2.179713
H  0.297973 -0.181572 -3.055514
H  1.001274 4.159891 -1.283244
H  3.206672 -0.068789 -0.015792
H  3.884814 -1.663034 0.384047
H  -4.238626 1.07786 -0.38984
H  -4.506962 -1.327749 -1.348436
H  -3.479279 2.86601 1.027273
H  -2.1842 2.813668 -0.198096
H  -1.849466 3.434229 1.424099
totalener: -1684.21643250 hartree
nucrepener: 2103.59917462 hartree
electener: -3787.81560711 hartree
oneelecener: -6492.00521163 hartree
twoeener: 2704.18960452 hartree
kineticenergy: 1679.29411407 hartree
xcener: -121.112965802291 hartree
chargesum: 0.0000000
charge: -0.126345 0.061794 -0.304101 -0.380430 0.001126 0.046362 -0.064970 -0.116913 -0.052690 -0.049875 0.236436 -0.073320 -0.118393 -0.264785 -0.333124 0.201187 -0.122001 -0.085984 -0.211995 -0.145410 -0.149301 0.126069 0.120069 0.106482 0.108145 0.091070 0.103685 0.098818 0.098210 0.114410 0.113967 0.125139 0.127148 0.145160 0.115395 0.126884 0.112254 0.106117 0.113707
qa: -0.1263 0.0618 -0.3041 -0.3804 0.0011 0.0464 -0.0650 -0.1169 -0.0527 -0.0499 0.2364 -0.0733 -0.1184 -0.2648 -0.3331 0.2012 -0.1220 -0.0860 -0.2120 -0.1454 -0.1493 0.1261 0.1201 0.1065 0.1081 0.0911 0.1037 0.0988 0.0982 0.1144 0.1140 0.1251 0.1271 0.1452 0.1154 0.1269 0.1123 0.1061 0.1137
va: 1.1447 2.7645 2.0515 2.1345 2.9239 3.6179 3.7892 3.8120 3.7291 3.6122 4.1628 3.8316 3.8956 3.9537 3.9645 3.9083 3.9653 3.9716 3.9527 4.0098 3.8909 0.9979 1.0491 1.0103 1.0090 1.0063 0.9985 0.9985 1.0132 0.9863 1.0037 1.0001 1.0063 1.0046 1.0127 1.0044 0.9884 0.9851 0.9977
dispcorr: -0.027029740 hartree
energy: -1684.243462237272
dipole: -6.22627 5.41561 -0.81066 19.03714 -16.99106 2.04608 5.50886 -5.56722 -0.05836
magnitude: 2.20160 au
magnitude: 5.59601 debye
