program: Orca
programVersion: 5.0.2
elementType: Cl S O O N C C C C C C C C C C C C C C C C H H H H H H H H H H H H H H H H H H
charge: 0
multiplicity: 1
keywords: wb97x-d3
keywords: def2-TZVPP
keywords: def2/J RIJCOSX
keywords: DEFGRID2
keywords: scfconv7
keywords: smallprint printgap noloewdin
keywords: NOSOSCF
formula: C16H18ClNO2S
InChI: InChI=1/C16H18ClNO2S/c1-11-5-4-6-12(2)16(11)18(15(19)9-17)10-14-13(20-3)7-8-21-14/h4-8H,9-10H2,1-3H3
39 atoms
Cl 2.252472 -1.992402 -1.770026
S  -2.325542 1.649183 0.733815
O  -2.383393 -2.16074 0.343566
O  1.178921 -2.483649 1.445145
N  0.657802 -0.380699 0.765465
C  1.036744 0.808912 0.081137
C  -0.513422 -0.302438 1.63968
C  1.872942 1.717631 0.747536
C  0.553194 1.073423 -1.201237
C  -1.779796 0.032397 0.930822
C  1.428611 -1.506331 0.777173
C  2.223097 2.897489 0.107423
C  0.936108 2.266838 -1.812126
C  2.418591 1.411214 2.112217
C  -0.367751 0.152668 -1.94362
C  -2.645699 -0.843997 0.332865
C  1.757063 3.171485 -1.169433
C  2.668573 -1.49024 -0.107943
C  -3.757486 -0.200609 -0.28038
C  -3.70373 1.153069 -0.134668
C  -3.318242 -3.01994 -0.257651
H  -0.32466 0.437361 2.423647
H  -0.615436 -1.266992 2.133624
H  2.870471 3.604969 0.610526
H  0.575328 2.481741 -2.810717
H  1.636535 1.189564 2.837996
H  3.089769 0.550198 2.103061
H  2.988182 2.255519 2.497091
H  -1.367779 0.587387 -1.999468
H  -0.014183 0.007124 -2.964455
H  -0.454296 -0.825561 -1.482808
H  2.039292 4.092744 -1.662053
H  3.151885 -0.518363 -0.17479
H  3.368652 -2.221565 0.287697
H  -4.558038 -0.704408 -0.801556
H  -4.419125 1.875738 -0.492776
H  -2.941726 -4.031157 -0.124549
H  -3.423756 -2.827136 -1.33003
H  -4.304864 -2.950369 0.211165
totalener: -1684.21647049 hartree
nucrepener: 2080.20169021 hartree
electener: -3764.41816070 hartree
oneelecener: -6445.48957807 hartree
twoeener: 2681.07141737 hartree
kineticenergy: 1679.28356511 hartree
xcener: -121.110072323030 hartree
chargesum: -0.0000000
charge: -0.129370 0.055032 -0.285304 -0.375692 0.029909 0.014420 -0.055445 -0.162157 -0.115171 -0.049056 0.245789 -0.026413 -0.047374 -0.237482 -0.336417 0.221366 -0.149892 -0.091854 -0.224323 -0.151557 -0.156122 0.121598 0.121038 0.107890 0.108334 0.100043 0.087983 0.090254 0.115046 0.117475 0.096176 0.124538 0.125522 0.146095 0.115753 0.125697 0.123895 0.098732 0.101043
qa: -0.1294 0.0550 -0.2853 -0.3757 0.0299 0.0144 -0.0554 -0.1622 -0.1152 -0.0491 0.2458 -0.0264 -0.0474 -0.2375 -0.3364 0.2214 -0.1499 -0.0919 -0.2243 -0.1516 -0.1561 0.1216 0.1210 0.1079 0.1083 0.1000 0.0880 0.0903 0.1150 0.1175 0.0962 0.1245 0.1255 0.1461 0.1158 0.1257 0.1239 0.0987 0.1010
va: 1.1426 2.7757 2.0809 2.1390 2.9023 3.6476 3.7543 3.9048 3.7865 3.6242 4.1542 3.8579 3.8980 3.9744 3.9876 3.8604 4.0200 3.9716 3.9649 4.0320 3.9163 1.0040 1.0514 1.0095 1.0059 1.0011 0.9966 1.0074 0.9855 1.0020 1.0093 1.0008 1.0054 1.0054 1.0137 1.0060 0.9973 0.9832 0.9844
dispcorr: -0.024937484 hartree
energy: -1684.241407969329
dipole: -4.46039 3.84493 -0.61546 4.55544 -3.52392 1.03152 1.82553 -2.16902 -0.34349
magnitude: 1.24932 au
magnitude: 3.17552 debye
