program: Orca
programVersion: 5.0.2
elementType: Cl S O O N C C C C C C C C C C C C C C C C H H H H H H H H H H H H H H H H H H
charge: 0
multiplicity: 1
keywords: wb97x-d3
keywords: def2-TZVPP
keywords: def2/J RIJCOSX
keywords: DEFGRID2
keywords: scfconv7
keywords: smallprint printgap noloewdin
keywords: NOSOSCF
formula: C16H18ClNO2S
InChI: InChI=1/C16H18ClNO2S/c1-11-5-4-6-12(2)16(11)18(15(19)9-17)10-14-13(20-3)7-8-21-14/h4-8H,9-10H2,1-3H3
39 atoms
Cl 3.85491 -1.123839 -0.345633
S  -2.546965 0.206984 -1.208996
O  -2.073138 -0.579133 2.511216
O  1.335493 -2.395471 1.668614
N  0.572011 -0.867863 0.178221
C  0.782987 0.290597 -0.619049
C  -0.733731 -1.522606 0.067635
C  0.649018 1.561509 -0.052061
C  1.040314 0.129761 -1.985555
C  -1.86637 -0.560701 0.168262
C  1.514467 -1.398909 1.005245
C  0.802012 2.673489 -0.873774
C  1.179299 1.265352 -2.772849
C  0.355297 1.779904 1.404513
C  1.141009 -1.226059 -2.620286
C  -2.478296 -0.123172 1.312387
C  1.063319 2.530476 -2.223279
C  2.853466 -0.678066 1.064654
C  -3.508218 0.829028 1.068487
C  -3.647353 1.09333 -0.260585
C  -2.794862 -0.169629 3.645075
H  -0.800908 -2.257013 0.867974
H  -0.789402 -2.07793 -0.872554
H  0.703765 3.663426 -0.444438
H  1.385453 1.153402 -3.830206
H  0.166447 0.859087 1.948897
H  1.184267 2.295201 1.895223
H  -0.526637 2.410667 1.521255
H  1.775578 -1.189102 -3.504753
H  1.558675 -1.972995 -1.948852
H  0.160504 -1.581504 -2.946752
H  1.176833 3.405721 -2.849439
H  2.769528 0.405766 1.075122
H  3.374375 -1.013057 1.957678
H  -4.120861 1.292174 1.82783
H  -4.353144 1.766468 -0.719952
H  -2.73867 0.912518 3.801196
H  -2.340775 -0.665046 4.500122
H  -3.848119 -0.462272 3.591902
totalener: -1684.21661333 hartree
nucrepener: 2086.13793264 hartree
electener: -3770.35454597 hartree
oneelecener: -6457.28112866 hartree
twoeener: 2686.92658268 hartree
kineticenergy: 1679.29064200 hartree
xcener: -121.111545557697 hartree
chargesum: -0.0000000
charge: -0.129433 0.057149 -0.295154 -0.378835 0.009826 0.030379 -0.104519 -0.112378 -0.128024 0.013714 0.234075 -0.048759 -0.023708 -0.340304 -0.284853 0.174393 -0.152874 -0.063764 -0.214469 -0.146457 -0.154093 0.124776 0.127870 0.109383 0.104897 0.108022 0.117055 0.109655 0.097600 0.108212 0.094384 0.123403 0.118938 0.143472 0.118748 0.126594 0.095943 0.122051 0.107085
qa: -0.1294 0.0571 -0.2952 -0.3788 0.0098 0.0304 -0.1045 -0.1124 -0.1280 0.0137 0.2341 -0.0488 -0.0237 -0.3403 -0.2849 0.1744 -0.1529 -0.0638 -0.2145 -0.1465 -0.1541 0.1248 0.1279 0.1094 0.1049 0.1080 0.1171 0.1097 0.0976 0.1082 0.0944 0.1234 0.1189 0.1435 0.1187 0.1266 0.0959 0.1221 0.1071
va: 1.1448 2.7817 2.0656 2.1354 2.8741 3.6133 3.7504 3.8009 3.8183 3.6112 4.1869 3.8963 3.8666 3.9595 3.9393 3.8682 4.0244 3.9616 3.9516 4.0480 3.9101 1.0519 1.0001 1.0049 1.0080 1.0106 0.9922 0.9948 1.0051 1.0115 0.9953 1.0005 1.0081 1.0093 1.0110 1.0039 0.9834 0.9975 0.9863
dispcorr: -0.025436527 hartree
energy: -1684.242049855374
dipole: -10.14695 9.00856 -1.13839 8.36309 -6.83318 1.52992 5.86735 -5.72883 0.13852
magnitude: 1.91201 au
magnitude: 4.85994 debye
