program: Orca
programVersion: 5.0.2
elementType: S F F F F F O O O O N N N C C C C C C C C C C C C H H H H H H H H H H H H H H
charge: 0
multiplicity: 1
keywords: wb97x-d3
keywords: def2-TZVPP
keywords: def2/J RIJCOSX
keywords: DEFGRID2
keywords: scfconv7
keywords: smallprint printgap noloewdin
keywords: NOSOSCF
formula: C12H14F5N3O4S
InChI: InChI=1/C12H14F5N3O4S/c1-11(2)4-7(19-24-11)25(21,22)5-6-8(12(15,16)17)18-20(3)9(6)23-10(13)14/h10H,4-5H2,1-3H3
39 atoms
S  -2.278795 0.016641 -0.199343
F  -0.999982 -2.624355 -2.427277
F  0.989407 -3.114769 -3.088865
F  0.194514 -4.01123 -1.303425
F  2.881177 -0.144797 2.490885
F  0.856155 -0.63439 3.016054
O  -1.113169 2.905607 2.003527
O  -3.600324 -0.236737 0.362382
O  -2.116373 0.107814 -1.64584
O  1.220548 0.702155 1.260967
N  -1.641196 1.708301 1.706388
N  2.263888 -0.399435 -0.534532
N  2.022365 -1.332818 -1.438875
C  -0.945666 3.709349 0.777231
C  -1.103016 2.673041 -0.346896
C  -1.661628 1.548362 0.446457
C  -1.147716 -1.229466 0.463369
C  0.421539 4.352908 0.829922
C  -2.065784 4.730837 0.761167
C  0.214736 -1.09836 -0.10292
C  0.800564 -1.7568 -1.198609
C  1.217652 -0.238901 0.295374
C  0.245619 -2.873335 -2.011828
C  3.544792 0.274745 -0.50715
C  1.629989 0.350415 2.521733
H  -0.155491 2.391771 -0.814866
H  -1.776225 3.015973 -1.132799
H  -1.176075 -1.119335 1.547089
H  -1.613172 -2.188485 0.226179
H  0.520234 4.999987 1.702218
H  1.215333 3.606152 0.8553
H  0.567838 4.968529 -0.057659
H  -3.045571 4.250041 0.755973
H  -2.008241 5.392193 1.626431
H  -1.991393 5.345068 -0.136451
H  4.288582 -0.33094 0.005165
H  3.864903 0.447483 -1.529823
H  3.448481 1.233267 -0.007204
H  1.578283 1.232648 3.154036
elementType: S F O N C H
totalener: -1828.41873319 hartree
nucrepener: 2830.32609347 hartree
electener: -4658.74482665 hartree
oneelecener: -8148.73948503 hartree
twoeener: 3489.99465838 hartree
cpcmener: -0.04908075 hartree
kineticenergy: 1822.29967604 hartree
xcener: -143.653884075575 hartree
chargesum: 0.0000000
charge: 0.861981 -0.173787 -0.167974 -0.179549 -0.199156 -0.199978 -0.248089 -0.539696 -0.538427 -0.318937 -0.049507 0.142769 -0.292507 0.239623 -0.064938 -0.094808 -0.146314 -0.278095 -0.308907 -0.121969 -0.009187 0.197407 0.504531 -0.163517 0.440444 0.123291 0.127446 0.164984 0.150985 0.104724 0.095849 0.105811 0.111478 0.103072 0.100319 0.131986 0.125982 0.127478 0.135181
qa: 0.8620 -0.1738 -0.1680 -0.1795 -0.1992 -0.2000 -0.2481 -0.5397 -0.5384 -0.3189 -0.0495 0.1428 -0.2925 0.2396 -0.0649 -0.0948 -0.1463 -0.2781 -0.3089 -0.1220 -0.0092 0.1974 0.5045 -0.1635 0.4404 0.1233 0.1274 0.1650 0.1510 0.1047 0.0958 0.1058 0.1115 0.1031 0.1003 0.1320 0.1260 0.1275 0.1352
va: 5.5161 1.1261 1.1400 1.1114 1.0887 1.0818 2.0138 1.9452 1.9401 2.0806 2.9515 3.3757 2.9321 3.8510 3.8801 3.9968 3.7981 3.9354 3.9921 3.6475 4.0670 4.1295 4.5380 3.8685 4.2015 1.0160 1.0182 1.0277 1.0283 1.0070 1.0093 1.0029 0.9993 1.0075 1.0035 0.9889 1.0027 0.9956 0.9826
dispcorr: -0.024507328 hartree
energy: -1828.443240517586
dipole: 0.58788 2.49563 3.08351 40.67355 -37.40832 3.26523 6.49194 -5.26468 1.22726
magnitude: 4.65575 au
magnitude: 11.83397 debye
