program: Orca
programVersion: 5.0.2
elementType: S F F F F F O O O O N N N C C C C C C C C C C C C H H H H H H H H H H H H H H
charge: 0
multiplicity: 1
keywords: wb97x-d3
keywords: def2-TZVPP
keywords: def2/J RIJCOSX
keywords: DEFGRID2
keywords: scfconv7
keywords: smallprint printgap noloewdin
keywords: NOSOSCF
formula: C12H14F5N3O4S
InChI: InChI=1/C12H14F5N3O4S/c1-11(2)4-7(19-24-11)25(21,22)5-6-8(12(15,16)17)18-20(3)9(6)23-10(13)14/h10H,4-5H2,1-3H3
39 atoms
S  -1.299627 0.83856 -1.560938
F  0.807881 -2.925822 -2.760483
F  0.178333 -4.456073 -1.383229
F  -1.225458 -2.976944 -2.068394
F  2.771747 1.307392 0.144423
F  3.23377 0.227437 1.94468
O  -0.333778 3.64079 0.838432
O  -2.288664 -0.151289 -1.148175
O  -1.504434 1.589391 -2.795088
O  1.089309 0.542623 1.405255
N  -0.26553 2.870745 -0.260056
N  0.923405 -1.801608 1.435595
N  0.641771 -2.817297 0.637968
C  -1.572037 3.35014 1.586194
C  -2.043945 2.018144 0.983469
C  -1.178985 1.990134 -0.222032
C  0.335204 0.072414 -1.643222
C  -2.54365 4.476186 1.287324
C  -1.211637 3.259872 3.050803
C  0.554453 -0.890162 -0.539985
C  0.413786 -2.288915 -0.544372
C  0.897252 -0.632151 0.770369
C  0.043358 -3.167847 -1.686422
C  1.24561 -2.035727 2.827986
C  2.349312 1.088078 1.403363
H  -3.107828 2.024012 0.746369
H  -1.845768 1.15539 1.624918
H  0.367291 -0.402987 -2.624975
H  1.056619 0.888804 -1.661335
H  -2.144177 5.437525 1.61177
H  -2.768769 4.535984 0.220864
H  -3.481895 4.304645 1.81521
H  -2.106095 3.039171 3.633224
H  -0.487067 2.465301 3.232001
H  -0.800154 4.201153 3.416567
H  2.289561 -2.318593 2.940923
H  1.045239 -1.141701 3.410099
H  0.613944 -2.838135 3.196429
H  2.318198 2.017043 1.966869
elementType: S F O N C H
totalener: -1828.41845719 hartree
nucrepener: 2822.27055421 hartree
electener: -4650.68901140 hartree
oneelecener: -8132.80708135 hartree
twoeener: 3482.11806995 hartree
cpcmener: -0.04824114 hartree
kineticenergy: 1822.30763728 hartree
xcener: -143.654881968728 hartree
chargesum: -0.0000000
charge: 0.862445 -0.178610 -0.167482 -0.174405 -0.198682 -0.199597 -0.250085 -0.538192 -0.539746 -0.326927 -0.052652 0.135533 -0.289925 0.234906 -0.064925 -0.090158 -0.146646 -0.305726 -0.276259 -0.127702 -0.017791 0.227886 0.505152 -0.164135 0.439284 0.128300 0.119544 0.147987 0.164977 0.103395 0.111573 0.099967 0.105518 0.097564 0.103974 0.131403 0.128199 0.125563 0.136475
qa: 0.8624 -0.1786 -0.1675 -0.1744 -0.1987 -0.1996 -0.2501 -0.5382 -0.5397 -0.3269 -0.0527 0.1355 -0.2899 0.2349 -0.0649 -0.0902 -0.1466 -0.3057 -0.2763 -0.1277 -0.0178 0.2279 0.5052 -0.1641 0.4393 0.1283 0.1195 0.1480 0.1650 0.1034 0.1116 0.1000 0.1055 0.0976 0.1040 0.1314 0.1282 0.1256 0.1365
va: 5.5111 1.1189 1.1413 1.1191 1.0823 1.0887 2.0107 1.9409 1.9434 2.0746 2.9421 3.3798 2.9350 3.8631 3.8707 4.0041 3.7974 3.9915 3.9340 3.6354 4.0852 4.1130 4.5385 3.8683 4.1971 1.0172 1.0198 1.0343 1.0271 1.0076 0.9994 1.0036 1.0033 1.0086 1.0070 0.9885 0.9969 1.0027 0.9824
dispcorr: -0.024171181 hartree
energy: -1828.442628374529
dipole: -13.74236 14.56558 0.82322 29.37864 -27.85353 1.52511 26.34132 -21.98582 4.35550
magnitude: 4.68765 au
magnitude: 11.91506 debye
