program: Orca
programVersion: 5.0.2
elementType: S F F F F F O O O O N N N C C C C C C C C C C C C H H H H H H H H H H H H H H
charge: 0
multiplicity: 1
keywords: wb97x-d3
keywords: def2-TZVPP
keywords: def2/J RIJCOSX
keywords: DEFGRID2
keywords: scfconv7
keywords: smallprint printgap noloewdin
keywords: NOSOSCF
formula: C12H14F5N3O4S
InChI: InChI=1/C12H14F5N3O4S/c1-11(2)4-7(19-24-11)25(21,22)5-6-8(12(15,16)17)18-20(3)9(6)23-10(13)14/h10H,4-5H2,1-3H3
39 atoms
S  -0.109449 1.939177 -0.970573
F  -1.599231 -2.91322 0.961106
F  -1.943761 -1.433474 -0.566292
F  -0.799265 -3.188874 -1.016468
F  3.744323 -0.045998 -1.728349
F  4.614935 -1.046527 -0.033292
O  -2.359809 1.461772 2.064781
O  -0.668173 2.604089 -2.144235
O  0.970715 2.580635 -0.230506
O  3.038527 0.499482 0.324356
N  -1.218104 1.59329 1.380576
N  1.9675 -1.26422 1.451853
N  0.875072 -2.00538 1.388806
C  -3.529318 1.508797 1.164604
C  -2.900455 1.626127 -0.237288
C  -1.463752 1.675055 0.135174
C  0.4501 0.29596 -1.475939
C  -4.331657 2.738507 1.534256
C  -4.311185 0.23061 1.377605
C  0.878406 -0.525264 -0.320042
C  0.211804 -1.57353 0.338065
C  2.020554 -0.379686 0.440434
C  -1.034184 -2.278266 -0.063665
C  2.930413 -1.477194 2.512564
C  4.117281 0.134237 -0.446797
H  -3.211464 2.534808 -0.754802
H  -3.138364 0.784487 -0.888192
H  -0.35731 -0.157527 -2.048894
H  1.263416 0.503024 -2.175822
H  -5.205067 2.811019 0.88588
H  -4.682976 2.687311 2.565343
H  -3.744588 3.649141 1.408747
H  -3.703166 -0.651924 1.18495
H  -4.692816 0.170341 2.397408
H  -5.165218 0.204828 0.70068
H  3.576478 -2.321423 2.283869
H  3.532399 -0.585011 2.651072
H  2.390093 -1.677267 3.432634
H  4.867903 0.916858 -0.373757
elementType: S F O N C H
totalener: -1828.41833060 hartree
nucrepener: 2822.91854567 hartree
electener: -4651.33687627 hartree
oneelecener: -8135.09659685 hartree
twoeener: 3483.75972058 hartree
cpcmener: -0.04706141 hartree
kineticenergy: 1822.29783345 hartree
xcener: -143.653514489441 hartree
chargesum: 0.0000000
charge: 0.862997 -0.174037 -0.181325 -0.175221 -0.197849 -0.198424 -0.238588 -0.551495 -0.537516 -0.323973 -0.042077 0.138842 -0.289975 0.253181 -0.096084 -0.071602 -0.125343 -0.302896 -0.293634 -0.161999 -0.019656 0.219570 0.539901 -0.165612 0.427989 0.123264 0.125395 0.152631 0.155914 0.103416 0.101927 0.108235 0.095253 0.104323 0.103370 0.131281 0.129575 0.126582 0.143659
qa: 0.8630 -0.1740 -0.1813 -0.1752 -0.1978 -0.1984 -0.2386 -0.5515 -0.5375 -0.3240 -0.0421 0.1388 -0.2900 0.2532 -0.0961 -0.0716 -0.1253 -0.3029 -0.2936 -0.1620 -0.0197 0.2196 0.5399 -0.1656 0.4280 0.1233 0.1254 0.1526 0.1559 0.1034 0.1019 0.1082 0.0953 0.1043 0.1034 0.1313 0.1296 0.1266 0.1437
va: 5.5159 1.1337 1.1133 1.1195 1.0869 1.0865 2.0347 1.9404 1.9388 2.1006 2.9552 3.3715 2.9289 3.8181 3.9224 3.9706 3.8048 3.9701 3.9558 3.7030 4.0263 4.1482 4.4612 3.8654 4.2081 1.0193 1.0182 1.0281 1.0253 1.0022 1.0076 1.0016 1.0226 1.0066 1.0026 0.9889 0.9971 1.0021 0.9748
dispcorr: -0.023669781 hartree
energy: -1828.442000384686
dipole: -21.03784 20.99163 -0.04622 15.87938 -16.59432 -0.71494 11.65503 -11.53566 0.11937
magnitude: 0.72631 au
magnitude: 1.84614 debye
