program: Orca
programVersion: 5.0.2
elementType: S F F F F F O O O O N N N C C C C C C C C C C C C H H H H H H H H H H H H H H
charge: 0
multiplicity: 1
keywords: wb97x-d3
keywords: def2-TZVPP
keywords: def2/J RIJCOSX
keywords: DEFGRID2
keywords: scfconv7
keywords: smallprint printgap noloewdin
keywords: NOSOSCF
formula: C12H14F5N3O4S
InChI: InChI=1/C12H14F5N3O4S/c1-11(2)4-7(19-24-11)25(21,22)5-6-8(12(15,16)17)18-20(3)9(6)23-10(13)14/h10H,4-5H2,1-3H3
39 atoms
S  -0.322687 1.667277 -1.620091
F  -1.393211 -2.122411 -1.366632
F  -0.36889 -3.700322 -0.328615
F  -1.856182 -2.544776 0.69607
F  3.825855 0.175958 -1.412753
F  4.513842 -0.402583 0.541552
O  -3.399254 0.470968 0.295265
O  -0.949115 1.959366 -2.901209
O  0.553575 2.654956 -1.000607
O  2.716668 0.921721 0.380229
N  -2.580475 0.6369 -0.750948
N  1.634189 -0.77257 1.596376
N  0.665488 -1.660162 1.468627
C  -2.943339 1.270616 1.447216
C  -1.553563 1.765868 1.009521
C  -1.575494 1.32845 -0.41054
C  0.582552 0.107802 -1.781699
C  -2.904796 0.357595 2.653108
C  -3.930333 2.409377 1.614512
C  0.864609 -0.490243 -0.454747
C  0.195065 -1.508913 0.248569
C  1.79954 -0.062482 0.467541
C  -0.861894 -2.463009 -0.191706
C  2.362012 -0.679248 2.843315
C  3.945956 0.608899 -0.143418
H  -0.73569 1.294694 1.561129
H  -1.442628 2.846087 1.111369
H  -0.012871 -0.537104 -2.423084
H  1.485675 0.375107 -2.33402
H  -3.88904 -0.062604 2.865137
H  -2.198982 -0.461433 2.514398
H  -2.590569 0.923424 3.530654
H  -3.968106 3.040392 0.724748
H  -4.935223 2.034955 1.814733
H  -3.634528 3.037451 2.455672
H  1.652298 -0.757381 3.662219
H  3.09171 -1.482555 2.920535
H  2.86722 0.279258 2.909564
H  4.569299 1.49858 -0.100533
elementType: S F O N C H
totalener: -1828.41643085 hartree
nucrepener: 2859.84106595 hartree
electener: -4688.25749681 hartree
oneelecener: -8208.14333163 hartree
twoeener: 3519.88583482 hartree
cpcmener: -0.04152697 hartree
kineticenergy: 1822.31790844 hartree
xcener: -143.656037414979 hartree
chargesum: 0.0000000
charge: 0.851461 -0.174032 -0.173247 -0.171413 -0.196111 -0.197796 -0.235341 -0.527239 -0.526785 -0.316530 -0.032818 0.143890 -0.290613 0.247700 -0.089209 -0.091724 -0.135753 -0.291981 -0.303611 -0.080280 -0.059696 0.182354 0.513854 -0.167477 0.426669 0.125735 0.122997 0.151968 0.151686 0.105637 0.092109 0.104158 0.110259 0.103066 0.098910 0.128085 0.134788 0.126224 0.140107
qa: 0.8515 -0.1740 -0.1732 -0.1714 -0.1961 -0.1978 -0.2353 -0.5272 -0.5268 -0.3165 -0.0328 0.1439 -0.2906 0.2477 -0.0892 -0.0917 -0.1358 -0.2920 -0.3036 -0.0803 -0.0597 0.1824 0.5139 -0.1675 0.4267 0.1257 0.1230 0.1520 0.1517 0.1056 0.0921 0.1042 0.1103 0.1031 0.0989 0.1281 0.1348 0.1262 0.1401
va: 5.5334 1.1264 1.1289 1.1280 1.0901 1.0876 2.0309 1.9641 1.9545 2.1076 2.9777 3.3690 2.9004 3.8476 3.9281 4.0250 3.8244 3.9497 3.9803 3.5897 4.0200 4.1548 4.5071 3.8651 4.2159 1.0071 1.0198 1.0314 1.0252 1.0080 1.0133 1.0031 1.0001 1.0077 1.0032 1.0004 0.9887 0.9988 0.9754
dispcorr: -0.025055747 hartree
energy: -1828.441486601233
dipole: -13.52342 15.69823 2.17482 19.16888 -18.46366 0.70522 21.59347 -18.38063 3.21284
magnitude: 3.94328 au
magnitude: 10.02303 debye
