program: Gaussian 09
title: 000056263
version: EM64L-G09RevD.01
frameworkgroup: C1[X(C12H19NO)]
method: RPBEPBE
basis: SDD
operation: Freq
keyword: #p
keyword: freq=noraman
keyword: PBEPBE/SDD
title: #p freq=noraman PBEPBE/SDD
converged: YES YES NO NO
title: Mulliken charges:
elementType: O N C C C C C C C C C C C C H H H H H H H H H H H H H H H H H H H
charge: -0.267754 -0.619341 -0.212842 0.474431 -0.382173 -0.289962 -0.342482 0.342076 -0.434654 -0.390750 -0.695749 -0.381583 -0.349881 -0.686931 0.196100 0.209558 0.209622 0.200388 0.199667 0.193143 0.193266 0.230838 0.274444 0.223501 0.202127 0.235784 0.245969 0.243233 0.212342 0.212207 0.216945 0.268324 0.270137
chargesum: 0.00000
title: Mulliken charges with hydrogens summed into heavy atoms:
elementType: O N C C C C C C C C C C C C
charge: -0.267754 -0.080880 -0.016742 0.474431 0.037007 0.110093 0.043926 0.342076 -0.203816 -0.116306 -0.034338 -0.135614 -0.106647 -0.045436
polarizability: 2.08378298e+02 -1.42623374e+00 1.30507492e+02 1.22395096e+00 -1.41874952e+00 9.30256091e+01
1716.lowfreq: -8.5257 -4.2315 -0.0009 -0.0005 -0.0004 7.5940 27.0624 45.0045 62.1512
frequency: 26.9845 44.9689 62.1256 64.9230 84.6384 124.7192 143.2868 160.6555 214.9134 230.6093 232.3034 237.6193 257.9144 295.8200 361.6287 388.7570 415.8788 416.6735 452.6836 513.0779 543.7896 557.7900 624.8802 637.9645 726.1928 736.2385 743.7856 802.6389 810.3208 829.6314 837.5243 903.5491 906.7521 940.6193 953.5368 971.4568 972.8101 980.5309 1002.3605 1041.5204 1042.0077 1084.4542 1103.5925 1124.2756 1130.6368 1146.2414 1166.0656 1178.4447 1213.5313 1216.1560 1235.5409 1274.7335 1279.9265 1286.8599 1297.5942 1320.5695 1343.0693 1348.1275 1376.4404 1379.3604 1390.9051 1396.3307 1416.5265 1466.3421 1469.4689 1471.2911 1473.5788 1477.3639 1481.8340 1490.7330 1501.1514 1585.3856 1620.7904 1637.1682 2858.6332 2939.9202 2966.0366 2974.3531 2975.6604 2993.8660 2995.6359 3009.7003 3057.7942 3070.3104 3074.0075 3075.7042 3096.9383 3113.8907 3139.3926 3159.7097 3163.0541 3452.4863 3584.0384
redmass: 3.5613 2.7066 3.9329 1.9283 3.0203 3.3103 1.9916 3.4182 3.5172 1.1466 1.7578 2.5495 1.8406 1.3651 2.5654 3.1118 3.8690 3.2082 3.2442 3.5028 2.4225 2.3599 2.8835 2.6935 3.1697 3.6283 1.0765 5.3374 1.1796 1.2215 1.5984 1.7930 2.3616 1.1547 1.3466 1.6422 3.2947 1.5448 2.7121 1.6133 3.3550 2.1710 1.5809 2.5746 1.9109 1.4526 1.3941 1.5809 1.3697 3.1412 1.6108 1.3002 1.1693 1.0730 1.3585 1.3681 2.2037 1.4760 1.5331 1.2552 1.3083 2.3572 3.0786 1.0519 1.0823 1.0861 1.0697 1.0427 1.1064 1.1529 2.0562 7.0401 4.5820 1.1830 1.0823 1.0549 1.0589 1.0369 1.0362 1.0593 1.1057 1.1010 1.1042 1.0974 1.1013 1.0995 1.1004 1.0893 1.0873 1.0945 1.0952 1.0447 1.0980
irintensity: 0.4050 0.9486 0.6336 0.3520 1.0836 0.2646 2.7854 1.3675 1.6173 0.1097 0.7022 13.1956 2.0039 36.2957 16.1192 0.3964 0.7890 2.2292 3.0356 8.6224 35.5347 54.2737 71.4120 54.9214 13.5484 1.2139 11.0308 8.6846 3.6603 0.2122 73.0150 18.8451 3.7114 0.2624 0.9236 18.0934 44.0091 1.8743 8.6281 6.8377 27.4570 8.2159 16.7675 8.4753 7.9901 1.5259 63.8806 23.5290 0.2090 227.6105 23.0424 4.1357 0.3987 0.0767 14.2348 18.3523 33.8043 2.9206 25.3784 22.6056 4.5399 15.1160 3.3975 7.4909 7.5387 6.4279 1.3219 12.9543 39.7146 39.9095 83.1804 11.2704 77.9627 36.8692 84.9247 32.8687 35.1641 49.6892 32.9873 38.6279 29.5345 5.4334 20.5537 51.9225 101.3709 50.9524 22.7432 20.8594 5.9967 17.6156 6.3435 1.6876 0.3475
temp: 298.150 k
press: 1.00000 atm
elementType: 8 7 6 6 6 6 6 6 6 6 6 6 6 6 1 1 1 1 1 1 1 1 1 1 1 1 1 1 1 1 1 1 1
symmnumber: 1
zpe: 749949.1 jmol-1
zpe.correction: 0.285641 hartree
zpe.thermalcorrener: 0.301290 hartree
zpe.thermalcorrenthalpy: 0.302235 hartree
zpe.thermalcorrgfe: 0.241671 hartree
zpe.sumelectzpe: -597.548772 hartree
zpe.sumelectthermal: -597.533123 hartree
zpe.sumelectthermalent: -597.532178 hartree
zpe.sumelectthermalfe: -597.592742 hartree
dipole: 0.1430 -0.8953 -0.4449
dipole: 1.0099
quadrupole: -68.1868 -85.0828 -86.6285
quadrupole: 4.3738 -3.6101 0.6023
quadrupole: 11.7793 -5.1168 -6.6625 4.3738 -3.6101 0.6023
hfenergy: -597.834413 hartree
pointgroup: C01 [X(C12H19N1O1)]
dipole: -0.0559523 0.190361 -0.344226 debye
polarizability: 208.3732841|-1.9833581|119.7285371|-0.2033317|-17.0271526|103.8095777 unknown
InChI: InChI=1S/C12H19NO/c1-3-4-9-14-12-7-5-11(6-8-12)10(2)13/h5-8,10H,3-4,9,13H2,1-2H3
charge 0 multiplicity 1
33 atoms
O  1.638268 -0.648634 0.506471
N  -4.467442 0.66453 -1.261341
C  -4.080739 0.037747 0.022224
C  -2.561415 -0.135861 0.094741
C  3.991291 -0.139638 0.284549
C  2.57686 0.350951 -0.032171
C  5.075071 0.829726 -0.242257
C  0.262735 -0.41407 0.334297
C  -1.992379 -1.264318 0.739983
C  -1.689042 0.844287 -0.433149
C  -4.593398 0.934301 1.178149
C  -0.597208 -1.407568 0.864697
C  -0.286167 0.716803 -0.322002
C  6.504859 0.344631 0.079688
H  -4.537576 -0.973671 0.162747
H  4.132259 -1.142348 -0.162834
H  4.092794 -0.260073 1.380307
H  2.383842 1.337552 0.440574
H  2.427563 0.451148 -1.128441
H  4.918133 1.835482 0.198663
H  4.963826 0.948231 -1.339596
H  -2.649443 -2.043258 1.148009
H  -2.128352 1.706138 -0.947292
H  -4.303507 0.513199 2.156458
H  -5.697278 1.022129 1.151994
H  -4.158625 1.94519 1.087427
H  -0.152751 -2.277073 1.358983
H  0.35926 1.492977 -0.744502
H  6.654114 0.249176 1.17151
H  6.69786 -0.646094 -0.372816
H  7.265712 1.047421 -0.306057
H  -5.450645 0.949223 -1.307723
H  -4.17138 0.139664 -2.090291
