program: Orca
programVersion: 5.0.2
elementType: S F F F F F O O O O N N N C C C C C C C C C C C C H H H H H H H H H H H H H H
charge: 0
multiplicity: 1
keywords: wb97x-d3
keywords: def2-TZVPP
keywords: def2/J RIJCOSX
keywords: DEFGRID2
keywords: scfconv7
keywords: smallprint printgap noloewdin
keywords: NOSOSCF
formula: C12H14F5N3O4S
InChI: InChI=1/C12H14F5N3O4S/c1-11(2)4-7(19-24-11)25(21,22)5-6-8(12(15,16)17)18-20(3)9(6)23-10(13)14/h10H,4-5H2,1-3H3
39 atoms
S  -0.896601 0.345943 0.727943
F  -1.437098 -2.723863 -1.356277
F  -0.173327 -4.468232 -1.420398
F  -0.916759 -3.757532 0.460402
F  2.633875 2.156843 0.429307
F  4.479657 1.12484 0.821784
O  -2.97003 3.170169 -0.791651
O  0.098166 0.824256 1.681914
O  -1.731169 -0.786642 1.107187
O  2.996328 0.191404 -0.493668
N  -2.10481 2.142877 -0.781278
N  2.817784 -2.132949 -0.315448
N  1.922058 -3.098549 -0.411363
C  -3.544434 3.380974 0.548029
C  -2.745458 2.415115 1.444027
C  -1.969273 1.703928 0.39666
C  -0.091492 -0.013375 -0.847467
C  -5.010795 3.006851 0.470885
C  -3.329532 4.834764 0.908923
C  0.895269 -1.099748 -0.636126
C  0.764169 -2.500679 -0.596661
C  2.249933 -0.923997 -0.447301
C  -0.445865 -3.359885 -0.726613
C  4.226882 -2.429486 -0.172533
C  3.160388 0.942632 0.650181
H  -3.386205 1.741438 2.015164
H  -2.084134 2.925937 2.147692
H  -0.867635 -0.269461 -1.566986
H  0.396608 0.903091 -1.181799
H  -5.543164 3.636489 -0.243262
H  -5.140439 1.96398 0.176732
H  -5.479745 3.138029 1.446867
H  -3.839241 5.497282 0.208077
H  -3.730233 5.031422 1.903827
H  -2.268998 5.08986 0.918711
H  4.322215 -3.480729 0.079502
H  4.756346 -2.23347 -1.103305
H  4.662601 -1.834031 0.625763
H  2.724197 0.492508 1.541887
elementType: S F O N C H
totalener: -1828.41968909 hartree
nucrepener: 2719.12820448 hartree
electener: -4547.54789357 hartree
oneelecener: -7927.35358107 hartree
twoeener: 3379.80568750 hartree
cpcmener: -0.03724726 hartree
kineticenergy: 1822.32535169 hartree
xcener: -143.657549123504 hartree
chargesum: 0.0000000
charge: 0.835447 -0.176150 -0.171950 -0.173505 -0.193957 -0.197996 -0.242497 -0.529491 -0.519976 -0.300479 -0.076237 0.122841 -0.299280 0.232679 -0.115909 0.006392 -0.114538 -0.301067 -0.283850 -0.143392 -0.030221 0.257201 0.501279 -0.159698 0.394776 0.124011 0.123905 0.155865 0.156015 0.102581 0.108972 0.099121 0.102163 0.100490 0.103149 0.119137 0.130809 0.123446 0.129916
qa: 0.8354 -0.1761 -0.1720 -0.1735 -0.1940 -0.1980 -0.2425 -0.5295 -0.5200 -0.3005 -0.0762 0.1228 -0.2993 0.2327 -0.1159 0.0064 -0.1145 -0.3011 -0.2838 -0.1434 -0.0302 0.2572 0.5013 -0.1597 0.3948 0.1240 0.1239 0.1559 0.1560 0.1026 0.1090 0.0991 0.1022 0.1005 0.1031 0.1191 0.1308 0.1234 0.1299
va: 5.5475 1.1240 1.1326 1.1207 1.0780 1.0786 2.0209 1.9456 1.9633 2.0633 2.9536 3.3883 2.9411 3.8737 3.9558 3.9302 3.7777 3.9792 3.9509 3.6519 4.0714 4.1012 4.5418 3.8798 4.2476 1.0137 1.0162 1.0227 1.0215 1.0073 1.0010 1.0030 1.0073 1.0027 1.0054 1.0070 0.9876 0.9949 0.9823
dispcorr: -0.021427309 hartree
energy: -1828.441116401054
dipole: -18.40063 18.85243 0.45180 28.96921 -27.15501 1.81420 6.97219 -6.54988 0.42231
magnitude: 1.91671 au
magnitude: 4.87190 debye
