program: Orca
programVersion: 5.0.2
elementType: S F F F F F O O O O N N N C C C C C C C C C C C C H H H H H H H H H H H H H H
charge: 0
multiplicity: 1
keywords: wb97x-d3
keywords: def2-TZVPP
keywords: def2/J RIJCOSX
keywords: DEFGRID2
keywords: scfconv7
keywords: smallprint printgap noloewdin
keywords: NOSOSCF
formula: C12H14F5N3O4S
InChI: InChI=1/C12H14F5N3O4S/c1-11(2)4-7(19-24-11)25(21,22)5-6-8(12(15,16)17)18-20(3)9(6)23-10(13)14/h10H,4-5H2,1-3H3
39 atoms
S  -0.1791 1.738445 -0.759243
F  -1.750596 -1.447932 1.03112
F  -1.655016 -2.238423 -0.970949
F  -1.181625 -3.493924 0.713633
F  4.528953 1.527405 -1.024313
F  4.637863 0.489651 0.861094
O  -3.809478 0.647571 -0.311585
O  -0.259311 2.751006 -1.805287
O  0.610312 2.008206 0.439307
O  3.356576 -0.277752 -0.792045
N  -2.607511 0.732037 -0.900662
N  2.435789 -1.995323 0.519665
N  1.27036 -2.55596 0.785616
C  -3.872082 1.544333 0.854903
C  -2.400861 1.936428 1.081736
C  -1.823633 1.422609 -0.18765
C  0.389251 0.199731 -1.534048
C  -4.476905 0.766193 2.002657
C  -4.721563 2.736326 0.455426
C  0.952905 -0.794382 -0.593437
C  0.372651 -1.856122 0.12663
C  2.293586 -0.936339 -0.295782
C  -1.055407 -2.262816 0.223939
C  3.653697 -2.533798 1.087264
C  3.80218 0.849299 -0.134162
H  -1.947395 1.44389 1.945368
H  -2.271591 3.01256 1.204101
H  -0.441874 -0.18017 -2.129479
H  1.153725 0.54299 -2.237158
H  -3.880179 -0.110304 2.254779
H  -4.530864 1.40044 2.887988
H  -5.490965 0.439201 1.768191
H  -5.731587 2.425199 0.184728
H  -4.798599 3.433913 1.290168
H  -4.287839 3.273413 -0.390144
H  3.493778 -3.589466 1.283693
H  4.473102 -2.42807 0.38183
H  3.903804 -2.029717 2.018459
H  3.000858 1.469584 0.269028
elementType: S F O N C H
totalener: -1828.41710049 hartree
nucrepener: 2783.02463214 hartree
electener: -4611.44173263 hartree
oneelecener: -8054.43387288 hartree
twoeener: 3442.99214025 hartree
cpcmener: -0.03350384 hartree
kineticenergy: 1822.29886796 hartree
xcener: -143.651022563705 hartree
chargesum: 0.0000000
charge: 0.853699 -0.173768 -0.175420 -0.165730 -0.190851 -0.200669 -0.237953 -0.522393 -0.533414 -0.306524 -0.051264 0.123984 -0.292055 0.218449 -0.063787 -0.069921 -0.200674 -0.274780 -0.302590 -0.114147 -0.012865 0.237708 0.513821 -0.169922 0.410659 0.110868 0.124448 0.171503 0.168635 0.098677 0.101782 0.102543 0.102504 0.098641 0.110777 0.122556 0.126917 0.131538 0.129018
qa: 0.8537 -0.1738 -0.1754 -0.1657 -0.1909 -0.2007 -0.2380 -0.5224 -0.5334 -0.3065 -0.0513 0.1240 -0.2921 0.2184 -0.0638 -0.0699 -0.2007 -0.2748 -0.3026 -0.1141 -0.0129 0.2377 0.5138 -0.1699 0.4107 0.1109 0.1244 0.1715 0.1686 0.0987 0.1018 0.1025 0.1025 0.0986 0.1108 0.1226 0.1269 0.1315 0.1290
va: 5.5042 1.1134 1.1220 1.1442 1.0951 1.0751 2.0214 1.9588 1.9462 2.0762 2.9296 3.3865 2.9392 3.8863 3.8815 3.9844 3.7973 3.9395 3.9865 3.5916 4.0624 4.1454 4.5064 3.8691 4.2267 1.0270 1.0144 1.0212 1.0149 1.0121 1.0025 1.0070 1.0078 1.0036 1.0004 1.0058 0.9963 0.9884 0.9929
dispcorr: -0.023082120 hartree
energy: -1828.440182607296
dipole: -20.40277 20.60751 0.20474 13.14877 -13.35436 -0.20559 9.46130 -8.07779 1.38351
magnitude: 1.41361 au
magnitude: 3.59310 debye
