program: Orca
programVersion: 5.0.2
elementType: S F F F F F O O O O N N N C C C C C C C C C C C C H H H H H H H H H H H H H H
charge: 0
multiplicity: 1
keywords: wb97x-d3
keywords: def2-TZVPP
keywords: def2/J RIJCOSX
keywords: DEFGRID2
keywords: scfconv7
keywords: smallprint printgap noloewdin
keywords: NOSOSCF
formula: C12H14F5N3O4S
InChI: InChI=1/C12H14F5N3O4S/c1-11(2)4-7(19-24-11)25(21,22)5-6-8(12(15,16)17)18-20(3)9(6)23-10(13)14/h10H,4-5H2,1-3H3
39 atoms
S  -0.046146 1.750069 -0.909924
F  -1.490605 -3.371835 0.688742
F  -2.010458 -1.549896 -0.337618
F  -0.887995 -3.066203 -1.356871
F  3.805546 -0.129887 -1.551178
F  4.853052 1.17416 -0.165666
O  -2.324702 1.029429 2.063062
O  -0.609098 2.412301 -2.073719
O  1.052778 2.344714 -0.165291
O  3.147517 0.091386 0.566792
N  -1.173092 1.169224 1.403156
N  1.973328 -1.649877 1.428752
N  0.861258 -2.360156 1.312917
C  -3.456368 1.439142 1.225996
C  -2.837172 1.58268 -0.175375
C  -1.398031 1.47616 0.193097
C  0.491661 0.09167 -1.423713
C  -3.945563 2.773842 1.761414
C  -4.514555 0.359455 1.319209
C  0.926393 -0.759674 -0.292944
C  0.230418 -1.843775 0.289997
C  2.058292 -0.683126 0.498493
C  -1.040268 -2.469489 -0.16811
C  2.912565 -1.919886 2.491873
C  3.649547 0.74279 -0.534339
H  -3.075595 2.536446 -0.646939
H  -3.140017 0.79337 -0.8672
H  -0.335186 -0.348571 -1.979702
H  1.282431 0.287694 -2.153482
H  -3.162203 3.531708 1.715819
H  -4.79054 3.129054 1.170355
H  -4.272438 2.685202 2.797436
H  -4.868396 0.242298 2.343484
H  -5.371744 0.623703 0.699161
H  -4.132101 -0.601012 0.977463
H  2.911941 -1.116987 3.226877
H  2.600296 -2.843394 2.967856
H  3.918418 -2.040224 2.09589
H  3.031344 1.578134 -0.859651
totalener: -1828.39404298 hartree
nucrepener: 2820.86592212 hartree
electener: -4649.25996510 hartree
oneelecener: -8130.05308046 hartree
twoeener: 3480.79311536 hartree
kineticenergy: 1822.37225839 hartree
xcener: -143.664833931165 hartree
chargesum: -0.0000000
charge: 0.827506 -0.148060 -0.187557 -0.168882 -0.186081 -0.169735 -0.181804 -0.470449 -0.482479 -0.285736 0.002288 0.114847 -0.262333 0.196418 -0.118625 -0.089950 -0.235971 -0.283675 -0.258263 -0.163482 -0.006422 0.272655 0.516644 -0.168710 0.377254 0.119048 0.106944 0.135649 0.154141 0.107732 0.086285 0.098557 0.097490 0.087483 0.099226 0.122775 0.119135 0.113616 0.112520
qa: 0.8275 -0.1481 -0.1876 -0.1689 -0.1861 -0.1697 -0.1818 -0.4704 -0.4825 -0.2857 0.0023 0.1148 -0.2623 0.1964 -0.1186 -0.0900 -0.2360 -0.2837 -0.2583 -0.1635 -0.0064 0.2727 0.5166 -0.1687 0.3773 0.1190 0.1069 0.1356 0.1541 0.1077 0.0863 0.0986 0.0975 0.0875 0.0992 0.1228 0.1191 0.1136 0.1125
va: 5.5488 1.1728 1.0978 1.1285 1.0818 1.1266 2.0822 2.0283 1.9953 2.1257 2.9468 3.3330 2.9140 3.8949 3.9280 3.9331 3.8933 3.9773 3.9346 3.6351 4.0255 4.1235 4.4779 3.8841 4.2575 1.0209 1.0211 1.0418 1.0143 1.0033 1.0055 1.0117 1.0112 1.0047 1.0187 0.9891 1.0087 0.9955 1.0070
dispcorr: -0.023573424 hartree
energy: -1828.417616398845
dipole: -22.57772 21.81755 -0.76017 14.46624 -14.65825 -0.19201 12.10343 -11.77260 0.33083
magnitude: 0.85099 au
magnitude: 2.16304 debye
