program: Orca
programVersion: 5.0.2
elementType: S O N C C C C C C C C C C C C C C H H H H H H H H H H H H H H H H H H H H H
charge: 0
multiplicity: 1
keywords: wb97x-d3
keywords: def2-TZVPP
keywords: def2/J RIJCOSX
keywords: DEFGRID2
keywords: scfconv7
keywords: smallprint printgap noloewdin
keywords: NOSOSCF
formula: C14H21NOS
InChI: InChI=1/C14H21NOS/c1-3-10-15(11-4-2)14(16)17-12-13-8-6-5-7-9-13/h5-9H,3-4,10-12H2,1-2H3
38 atoms
S  -0.203636 -1.355412 1.03719
O  -0.342337 1.175202 1.779246
N  -2.192154 0.370211 0.740515
C  -2.903244 1.640104 0.871133
C  -2.824159 -0.679311 -0.050352
C  -2.88598 2.511387 -0.378594
C  -2.381888 -0.749787 -1.507497
C  -0.940352 0.271616 1.215937
C  -1.495384 2.869282 -0.876717
C  -3.035658 -1.925864 -2.214896
C  1.498152 -1.041351 1.6002
C  2.417239 -0.628495 0.490136
C  3.121503 -1.595385 -0.223896
C  2.587551 0.711975 0.149784
C  3.979683 -1.233837 -1.252942
C  3.44427 1.075178 -0.880173
C  4.143189 0.10435 -1.585067
H  -2.481245 2.187455 1.711503
H  -3.935677 1.406786 1.137265
H  -3.899809 -0.503632 -0.00368
H  -2.672063 -1.647513 0.435087
H  -3.456026 2.030257 -1.176751
H  -3.433969 3.424079 -0.130934
H  -2.644196 0.178813 -2.017473
H  -1.295666 -0.843983 -1.56387
H  -0.924364 1.98449 -1.163666
H  -1.556302 3.511142 -1.756039
H  -0.922336 3.404415 -0.118351
H  -2.736277 -1.969288 -3.261955
H  -2.75535 -2.873749 -1.752116
H  -4.124373 -1.853832 -2.187015
H  1.471698 -0.313371 2.408879
H  1.820051 -1.99048 2.02926
H  3.002934 -2.641383 0.03371
H  2.05701 1.480122 0.69659
H  4.524565 -1.997878 -1.792192
H  3.57017 2.121072 -1.128597
H  4.814148 0.389013 -2.384999
elementType: S O N C H
totalener: -1074.41138594 hartree
nucrepener: 1365.32286119 hartree
electener: -2439.73424713 hartree
oneelecener: -4179.46203357 hartree
twoeener: 1739.72778643 hartree
cpcmener: -0.02367880 hartree
kineticenergy: 1070.55746379 hartree
xcener: -87.041602920535 hartree
chargesum: -0.0000000
charge: -0.116789 -0.542170 -0.113902 -0.057247 -0.085794 -0.111969 -0.082202 0.304527 -0.270690 -0.279342 -0.064336 0.035409 -0.216050 -0.201677 -0.144369 -0.148874 -0.177582 0.100215 0.103563 0.112009 0.105139 0.075559 0.079143 0.074160 0.060728 0.071507 0.098728 0.086095 0.093324 0.084367 0.083859 0.128042 0.144096 0.142365 0.148944 0.160075 0.160429 0.160713
qa: -0.1168 -0.5422 -0.1139 -0.0572 -0.0858 -0.1120 -0.0822 0.3045 -0.2707 -0.2793 -0.0643 0.0354 -0.2161 -0.2017 -0.1444 -0.1489 -0.1776 0.1002 0.1036 0.1120 0.1051 0.0756 0.0791 0.0742 0.0607 0.0715 0.0987 0.0861 0.0933 0.0844 0.0839 0.1280 0.1441 0.1424 0.1489 0.1601 0.1604 0.1607
va: 2.3224 1.9447 3.1748 3.8493 3.8711 3.8625 3.8261 4.2681 3.9283 3.9627 3.7689 3.5751 3.9824 3.9240 3.8762 3.9031 3.9042 1.0222 1.0065 0.9976 1.0011 1.0023 1.0135 1.0091 1.0301 1.0002 1.0061 1.0071 1.0026 1.0016 1.0010 1.0316 1.0040 1.0043 1.0172 0.9894 0.9907 0.9895
dispcorr: -0.017749091 hartree
energy: -1074.429135034876
dipole: -14.49511 13.34282 -1.15229 5.04302 -5.59797 -0.55495 -11.57641 10.62778 -0.94863
magnitude: 1.59237 au
magnitude: 4.04747 debye
