program: Orca
programVersion: 5.0.2
elementType: S O N C C C C C C C C C C C C C C H H H H H H H H H H H H H H H H H H H H H
charge: 0
multiplicity: 1
keywords: wb97x-d3
keywords: def2-TZVPP
keywords: def2/J RIJCOSX
keywords: DEFGRID2
keywords: scfconv7
keywords: smallprint printgap noloewdin
keywords: NOSOSCF
formula: C14H21NOS
InChI: InChI=1/C14H21NOS/c1-3-10-15(11-4-2)14(16)17-12-13-8-6-5-7-9-13/h5-9H,3-4,10-12H2,1-2H3
38 atoms
S  -0.067557 -0.977312 1.176883
O  -0.218432 1.646476 0.915044
N  -2.015914 0.510721 0.149354
C  -2.741933 1.747801 -0.12526
C  -2.712905 -0.726208 -0.175413
C  -3.528467 2.248709 1.078388
C  -2.663458 -1.080994 -1.656516
C  -0.796126 0.591582 0.698605
C  -4.290152 3.524483 0.755922
C  -1.266651 -1.338504 -2.198095
C  1.623003 -0.462166 1.609809
C  2.581458 -0.641725 0.471449
C  3.376864 -1.781946 0.400622
C  2.682575 0.311074 -0.540887
C  4.252399 -1.971961 -0.660283
C  3.557609 0.123445 -1.600476
C  4.34405 -1.020035 -1.665628
H  -3.422579 1.549766 -0.954472
H  -2.048486 2.512234 -0.474824
H  -3.751955 -0.606235 0.137894
H  -2.323023 -1.550853 0.421347
H  -4.226175 1.471603 1.401613
H  -2.845533 2.425231 1.912597
H  -3.281361 -1.971815 -1.792194
H  -3.144975 -0.289368 -2.236639
H  -4.853345 3.874077 1.621159
H  -3.612651 4.326474 0.45831
H  -4.999593 3.371507 -0.058987
H  -1.310507 -1.591863 -3.257729
H  -0.620957 -0.464781 -2.102118
H  -0.781058 -2.16538 -1.679768
H  1.590358 0.566161 1.964756
H  1.903818 -1.091971 2.453873
H  3.311943 -2.528676 1.183209
H  2.077274 1.2078 -0.500198
H  4.863474 -2.86433 -0.69963
H  3.627273 0.87377 -2.377333
H  5.026273 -1.165194 -2.492948
elementType: S O N C H
totalener: -1074.41114462 hartree
nucrepener: 1345.90878568 hartree
electener: -2420.31993030 hartree
oneelecener: -4140.56857525 hartree
twoeener: 1720.24864495 hartree
cpcmener: -0.02395498 hartree
kineticenergy: 1070.56098019 hartree
xcener: -87.041465071038 hartree
chargesum: -0.0000000
charge: -0.121244 -0.550481 -0.120024 -0.055846 -0.079590 -0.075889 -0.082092 0.313468 -0.275399 -0.281973 -0.063573 0.044883 -0.217294 -0.213310 -0.139727 -0.146231 -0.180549 0.107927 0.092102 0.112725 0.108817 0.063394 0.064086 0.072179 0.066329 0.092515 0.082754 0.082342 0.098847 0.077349 0.080621 0.130775 0.140900 0.142288 0.147350 0.160111 0.160652 0.160809
qa: -0.1212 -0.5505 -0.1200 -0.0558 -0.0796 -0.0759 -0.0821 0.3135 -0.2754 -0.2820 -0.0636 0.0449 -0.2173 -0.2133 -0.1397 -0.1462 -0.1805 0.1079 0.0921 0.1127 0.1088 0.0634 0.0641 0.0722 0.0663 0.0925 0.0828 0.0823 0.0988 0.0773 0.0806 0.1308 0.1409 0.1423 0.1473 0.1601 0.1607 0.1608
va: 2.3143 1.9392 3.1891 3.8323 3.9066 3.8565 3.8458 4.2476 3.9432 3.9434 3.7558 3.5809 3.9776 3.9187 3.8719 3.9054 3.9067 0.9983 1.0220 1.0028 1.0045 1.0138 1.0180 1.0137 1.0094 1.0029 1.0005 1.0014 1.0070 1.0017 1.0038 1.0335 1.0060 1.0042 1.0201 0.9894 0.9906 0.9895
dispcorr: -0.016969249 hartree
energy: -1074.428113868868
dipole: -17.68604 16.43167 -1.25437 5.39348 -6.27933 -0.88585 -6.96802 6.37368 -0.59434
magnitude: 1.64664 au
magnitude: 4.18542 debye
