program: Orca
programVersion: 5.0.2
elementType: S O N C C C C C C C C C C C C C C H H H H H H H H H H H H H H H H H H H H H
charge: 0
multiplicity: 1
keywords: wb97x-d3
keywords: def2-TZVPP
keywords: def2/J RIJCOSX
keywords: DEFGRID2
keywords: scfconv7
keywords: smallprint printgap noloewdin
keywords: NOSOSCF
formula: C14H21NOS
InChI: InChI=1/C14H21NOS/c1-3-10-15(11-4-2)14(16)17-12-13-8-6-5-7-9-13/h5-9H,3-4,10-12H2,1-2H3
38 atoms
S  -0.070326 -1.492064 -0.120656
O  -0.257589 0.589526 -1.740825
N  -1.943337 0.379178 -0.249022
C  -2.618787 1.566805 -0.762092
C  -2.572594 -0.297775 0.874863
C  -2.137632 2.851966 -0.103993
C  -3.554687 -1.382733 0.459042
C  -0.789057 -0.00158 -0.8126
C  -2.882485 4.064723 -0.638026
C  -4.214889 -2.023575 1.668303
C  1.526521 -1.555079 -0.992697
C  2.622218 -0.833894 -0.267097
C  2.87343 0.518734 -0.488268
C  3.412509 -1.520063 0.652196
C  3.8905 1.168799 0.196905
C  4.431225 -0.872161 1.336605
C  4.672892 0.476263 1.11139
H  -3.687523 1.433777 -0.583823
H  -2.492737 1.62082 -1.843487
H  -3.089651 0.464899 1.460466
H  -1.808794 -0.705631 1.540526
H  -2.276612 2.77745 0.977887
H  -1.065007 2.969066 -0.275102
H  -4.315804 -0.948073 -0.194495
H  -3.034011 -2.142585 -0.128856
H  -3.957297 3.978748 -0.469664
H  -2.545985 4.979087 -0.149232
H  -2.725195 4.187669 -1.710818
H  -4.762116 -1.287446 2.259605
H  -4.922818 -2.795627 1.367281
H  -3.47736 -2.49061 2.323206
H  1.752577 -2.619287 -1.066238
H  1.384397 -1.183511 -2.006004
H  2.277936 1.069195 -1.204396
H  3.231944 -2.573887 0.829232
H  4.075008 2.219095 0.011353
H  5.038501 -1.422184 2.043761
H  5.467789 0.983425 1.642445
elementType: S O N C H
totalener: -1074.41313156 hartree
nucrepener: 1325.24962037 hartree
electener: -2399.66275193 hartree
oneelecener: -4099.21606883 hartree
twoeener: 1699.55331691 hartree
cpcmener: -0.02409100 hartree
kineticenergy: 1070.55734000 hartree
xcener: -87.038917798399 hartree
chargesum: 0.0000000
charge: -0.119686 -0.553062 -0.115818 -0.052269 -0.096849 -0.077650 -0.066031 0.315356 -0.274897 -0.275357 -0.058583 0.027899 -0.192673 -0.216630 -0.153037 -0.143518 -0.178363 0.107588 0.092831 0.114619 0.103750 0.064386 0.062897 0.069795 0.054765 0.081656 0.092227 0.083144 0.083123 0.092418 0.083460 0.143811 0.128289 0.149018 0.141957 0.160233 0.160507 0.160693
qa: -0.1197 -0.5531 -0.1158 -0.0523 -0.0968 -0.0776 -0.0660 0.3154 -0.2749 -0.2754 -0.0586 0.0279 -0.1927 -0.2166 -0.1530 -0.1435 -0.1784 0.1076 0.0928 0.1146 0.1037 0.0644 0.0629 0.0698 0.0548 0.0817 0.0922 0.0831 0.0831 0.0924 0.0835 0.1438 0.1283 0.1490 0.1420 0.1602 0.1605 0.1607
va: 2.3190 1.9368 3.1927 3.8323 3.8778 3.8629 3.8381 4.2620 3.9416 3.9413 3.7568 3.5939 3.9271 3.9814 3.9087 3.8745 3.9037 0.9973 1.0202 0.9948 1.0141 1.0134 1.0184 1.0144 1.0272 1.0016 1.0028 1.0006 1.0017 1.0030 1.0007 1.0040 1.0310 1.0184 1.0046 0.9910 0.9893 0.9895
dispcorr: -0.015683365 hartree
energy: -1074.428814923708
dipole: -19.75018 18.63521 -1.11497 7.92929 -8.12812 -0.19883 4.77650 -3.65512 1.12138
magnitude: 1.59380 au
magnitude: 4.05111 debye
