program: Orca
programVersion: 5.0.2
elementType: S O N C C C C C C C C C C C C C C H H H H H H H H H H H H H H H H H H H H H
charge: 0
multiplicity: 1
keywords: wb97x-d3
keywords: def2-TZVPP
keywords: def2/J RIJCOSX
keywords: DEFGRID2
keywords: scfconv7
keywords: smallprint printgap noloewdin
keywords: NOSOSCF
formula: C14H21NOS
InChI: InChI=1/C14H21NOS/c1-3-10-15(11-4-2)14(16)17-12-13-8-6-5-7-9-13/h5-9H,3-4,10-12H2,1-2H3
38 atoms
S  -0.103034 -1.585439 -0.093491
O  -0.569839 0.395809 -1.774225
N  -2.032921 0.234509 -0.049781
C  -2.742717 1.451706 -0.439704
C  -2.485107 -0.431671 1.166083
C  -2.283905 2.683854 0.330705
C  -3.370473 -1.648666 0.92832
C  -0.957235 -0.149642 -0.751917
C  -0.827962 3.067474 0.116769
C  -4.680402 -1.338503 0.221112
C  1.443215 -1.535356 -1.054177
C  2.497203 -0.686057 -0.410184
C  3.390207 -1.255178 0.495057
C  2.603342 0.675484 -0.688402
C  4.368028 -0.485513 1.109364
C  3.578827 1.447284 -0.072492
C  4.464006 0.870933 0.828754
H  -3.804744 1.286958 -0.25786
H  -2.63206 1.606283 -1.511578
H  -3.036287 0.307712 1.749107
H  -1.624373 -0.704565 1.780027
H  -2.929144 3.510951 0.023948
H  -2.47237 2.535412 1.397824
H  -2.819239 -2.409457 0.370431
H  -3.580264 -2.08418 1.908326
H  -0.141818 2.296603 0.471117
H  -0.610242 3.25252 -0.935727
H  -0.590865 3.979388 0.666063
H  -4.523511 -0.97531 -0.795126
H  -5.300781 -2.232369 0.150409
H  -5.254134 -0.582408 0.760031
H  1.765833 -2.575662 -1.10553
H  1.21431 -1.216567 -2.069248
H  3.322892 -2.313818 0.716928
H  1.927174 1.137938 -1.395079
H  5.057194 -0.946926 1.804764
H  3.649777 2.502601 -0.302267
H  5.226638 1.47357 1.304531
elementType: S O N C H
totalener: -1074.41014109 hartree
nucrepener: 1362.58274229 hartree
electener: -2436.99288338 hartree
oneelecener: -4174.00708722 hartree
twoeener: 1737.01420384 hartree
cpcmener: -0.02376813 hartree
kineticenergy: 1070.55599795 hartree
xcener: -87.040965408142 hartree
chargesum: -0.0000000
charge: -0.119358 -0.542078 -0.112925 -0.060406 -0.084274 -0.096836 -0.091633 0.302648 -0.265155 -0.277278 -0.061936 0.042869 -0.220222 -0.215360 -0.143626 -0.143284 -0.180205 0.112702 0.101199 0.112386 0.109320 0.072407 0.063508 0.059648 0.072951 0.068082 0.083797 0.097319 0.080407 0.098149 0.087360 0.142875 0.128214 0.141973 0.154018 0.161046 0.160196 0.161501
qa: -0.1194 -0.5421 -0.1129 -0.0604 -0.0843 -0.0968 -0.0916 0.3026 -0.2652 -0.2773 -0.0619 0.0429 -0.2202 -0.2154 -0.1436 -0.1433 -0.1802 0.1127 0.1012 0.1124 0.1093 0.0724 0.0635 0.0596 0.0730 0.0681 0.0838 0.0973 0.0804 0.0981 0.0874 0.1429 0.1282 0.1420 0.1540 0.1610 0.1602 0.1615
va: 2.3207 1.9476 3.1349 3.8390 3.8490 3.8884 3.8589 4.2843 3.9266 3.9254 3.7564 3.5792 3.9865 3.9157 3.8736 3.8957 3.9084 0.9994 1.0222 0.9978 1.0225 1.0132 1.0106 1.0241 1.0147 1.0020 1.0049 1.0071 1.0011 1.0059 0.9980 1.0040 1.0324 1.0045 1.0133 0.9890 0.9912 0.9892
dispcorr: -0.017849806 hartree
energy: -1074.427990898155
dipole: -16.25542 15.34223 -0.91319 7.51654 -7.58889 -0.07235 4.88015 -3.50391 1.37624
magnitude: 1.65324 au
magnitude: 4.20219 debye
