program: Orca
programVersion: 5.0.2
elementType: S O N C C C C C C C C C C C C C C H H H H H H H H H H H H H H H H H H H H H
charge: 0
multiplicity: 1
keywords: wb97x-d3
keywords: def2-TZVPP
keywords: def2/J RIJCOSX
keywords: DEFGRID2
keywords: scfconv7
keywords: smallprint printgap noloewdin
keywords: NOSOSCF
formula: C14H21NOS
InChI: InChI=1/C14H21NOS/c1-3-10-15(11-4-2)14(16)17-12-13-8-6-5-7-9-13/h5-9H,3-4,10-12H2,1-2H3
38 atoms
S  -0.270507 -1.796499 0.097655
O  -0.358157 0.287645 1.688538
N  -1.903345 0.321378 0.036042
C  -2.336082 1.671327 0.387311
C  -2.593375 -0.298671 -1.084518
C  -1.678968 2.746849 -0.471111
C  -3.930516 -0.923334 -0.70659
C  -0.883049 -0.22501 0.713117
C  -0.159957 2.798679 -0.389226
C  -3.826195 -2.087701 0.264205
C  1.37816 -1.79178 0.869832
C  2.281724 -0.734132 0.309074
C  2.703999 0.334013 1.094441
C  2.707283 -0.801293 -1.016969
C  3.520845 1.324553 0.563136
C  3.527809 0.182181 -1.547544
C  3.931423 1.254172 -0.759833
H  -2.13996 1.851563 1.442704
H  -3.418808 1.718442 0.262851
H  -1.948524 -1.04288 -1.553756
H  -2.752862 0.47099 -1.842111
H  -1.98485 2.618723 -1.513066
H  -2.096405 3.70535 -0.15247
H  -4.590285 -0.15423 -0.296345
H  -4.400266 -1.258363 -1.634336
H  0.222487 3.62468 -0.989866
H  0.186521 2.950258 0.633664
H  0.305311 1.888265 -0.771445
H  -4.813349 -2.497684 0.479651
H  -3.2178 -2.895979 -0.144236
H  -3.387309 -1.790709 1.217657
H  1.280694 -1.716807 1.951264
H  1.761295 -2.789761 0.648701
H  2.394247 0.394708 2.129803
H  2.393271 -1.63072 -1.640009
H  3.833098 2.152819 1.186036
H  3.855264 0.111979 -2.576773
H  4.56661 2.025731 -1.175061
elementType: S O N C H
totalener: -1074.41010163 hartree
nucrepener: 1392.63330645 hartree
electener: -2467.04340808 hartree
oneelecener: -4234.46800729 hartree
twoeener: 1767.42459921 hartree
cpcmener: -0.02530556 hartree
kineticenergy: 1070.56204261 hartree
xcener: -87.043916720854 hartree
chargesum: 0.0000000
charge: -0.119351 -0.535751 -0.109815 -0.058096 -0.081187 -0.092074 -0.074056 0.291926 -0.262134 -0.289974 -0.045032 0.047096 -0.201404 -0.211313 -0.156750 -0.149391 -0.172678 0.099643 0.109260 0.104763 0.110253 0.062999 0.072323 0.063979 0.071259 0.099949 0.082004 0.059624 0.098988 0.082892 0.084236 0.117292 0.146902 0.136187 0.136482 0.159511 0.160409 0.161029
qa: -0.1194 -0.5358 -0.1098 -0.0581 -0.0812 -0.0921 -0.0741 0.2919 -0.2621 -0.2900 -0.0450 0.0471 -0.2014 -0.2113 -0.1568 -0.1494 -0.1727 0.0996 0.1093 0.1048 0.1103 0.0630 0.0723 0.0640 0.0713 0.0999 0.0820 0.0596 0.0990 0.0829 0.0842 0.1173 0.1469 0.1362 0.1365 0.1595 0.1604 0.1610
va: 2.3204 1.9599 3.1452 3.8457 3.8734 3.8881 3.8452 4.2865 3.9253 3.9337 3.8059 3.4939 3.9023 3.9685 3.8737 3.8881 3.8944 1.0233 1.0033 1.0208 1.0044 1.0096 1.0134 1.0108 1.0139 1.0070 1.0060 1.0028 1.0066 1.0008 1.0016 1.0314 1.0007 1.0186 1.0126 0.9907 0.9895 0.9890
dispcorr: -0.019297069 hartree
energy: -1074.429398697805
dipole: -13.14734 12.14021 -1.00714 7.25797 -7.16261 0.09536 -4.43546 3.07632 -1.35914
magnitude: 1.69431 au
magnitude: 4.30658 debye
