program: Orca
programVersion: 5.0.2
elementType: S O N C C C C C C C C C C C C C C H H H H H H H H H H H H H H H H H H H H H
charge: 0
multiplicity: 1
keywords: wb97x-d3
keywords: def2-TZVPP
keywords: def2/J RIJCOSX
keywords: DEFGRID2
keywords: scfconv7
keywords: smallprint printgap noloewdin
keywords: NOSOSCF
formula: C14H21NOS
InChI: InChI=1/C14H21NOS/c1-3-10-15(11-4-2)14(16)17-12-13-8-6-5-7-9-13/h5-9H,3-4,10-12H2,1-2H3
38 atoms
S  -0.14751 -0.81993 1.298447
O  -0.260974 1.767803 0.810422
N  -2.019692 0.575292 0.026038
C  -2.74693 1.77403 -0.387891
C  -2.659712 -0.693126 -0.299867
C  -3.83097 2.19333 0.596113
C  -2.439866 -1.12821 -1.743485
C  -0.834654 0.702859 0.639327
C  -3.318074 2.588311 1.970683
C  -0.994147 -1.427536 -2.104722
C  1.568758 -0.3116 1.627503
C  2.457306 -0.537826 0.441973
C  3.132937 -1.747196 0.29896
C  2.604938 0.43327 -0.546652
C  3.934123 -1.986589 -0.808588
C  3.405279 0.195168 -1.655177
C  4.071347 -1.01565 -1.791327
H  -3.199332 1.565827 -1.358633
H  -2.04177 2.587623 -0.547073
H  -3.728631 -0.575663 -0.113559
H  -2.332253 -1.475302 0.384292
H  -4.359803 3.036777 0.146364
H  -4.569408 1.393367 0.692063
H  -3.050199 -2.020023 -1.903534
H  -2.840653 -0.366694 -2.417502
H  -2.602271 3.408317 1.910782
H  -4.14132 2.917099 2.605718
H  -2.832783 1.756779 2.481897
H  -0.345669 -0.56174 -1.964238
H  -0.590423 -2.240786 -1.502087
H  -0.917661 -1.721609 -3.151945
H  1.572048 0.724561 1.960387
H  1.883566 -0.927122 2.470655
H  3.031896 -2.508972 1.063098
H  2.095743 1.383481 -0.451113
H  4.453568 -2.931432 -0.902253
H  3.511464 0.960235 -2.413329
H  4.696544 -1.199602 -2.65521
elementType: S O N C H
totalener: -1074.41001274 hartree
nucrepener: 1370.25196503 hartree
electener: -2444.66197778 hartree
oneelecener: -4189.39607168 hartree
twoeener: 1744.73409390 hartree
cpcmener: -0.02422236 hartree
kineticenergy: 1070.56963431 hartree
xcener: -87.044531427387 hartree
chargesum: 0.0000000
charge: -0.121300 -0.543560 -0.106407 -0.059370 -0.077265 -0.088909 -0.082172 0.296017 -0.274951 -0.275460 -0.061973 0.045519 -0.220407 -0.216193 -0.138025 -0.140949 -0.181836 0.109392 0.099334 0.113564 0.107569 0.070259 0.061424 0.070923 0.065554 0.083303 0.096308 0.077055 0.072330 0.080832 0.099011 0.127951 0.142558 0.141567 0.146342 0.160638 0.160625 0.160702
qa: -0.1213 -0.5436 -0.1064 -0.0594 -0.0773 -0.0889 -0.0822 0.2960 -0.2750 -0.2755 -0.0620 0.0455 -0.2204 -0.2162 -0.1380 -0.1409 -0.1818 0.1094 0.0993 0.1136 0.1076 0.0703 0.0614 0.0709 0.0656 0.0833 0.0963 0.0771 0.0723 0.0808 0.0990 0.1280 0.1426 0.1416 0.1463 0.1606 0.1606 0.1607
va: 2.3026 1.9450 3.1642 3.8474 3.9063 3.8734 3.8548 4.2609 3.9278 3.9414 3.7661 3.5534 3.9762 3.9100 3.8710 3.8973 3.9092 1.0037 1.0239 1.0034 1.0049 1.0132 1.0108 1.0136 1.0100 1.0047 1.0054 1.0036 1.0017 1.0039 1.0074 1.0334 1.0045 1.0047 1.0211 0.9889 0.9901 0.9895
dispcorr: -0.018288832 hartree
energy: -1074.428301576799
dipole: -15.20175 13.99413 -1.20762 2.92330 -3.87315 -0.94985 -5.65763 4.92152 -0.73612
magnitude: 1.70365 au
magnitude: 4.33035 debye
