program: Orca
programVersion: 5.0.2
elementType: S O N C C C C C C C C C C C C C C H H H H H H H H H H H H H H H H H H H H H
charge: 0
multiplicity: 1
keywords: wb97x-d3
keywords: def2-TZVPP
keywords: def2/J RIJCOSX
keywords: DEFGRID2
keywords: scfconv7
keywords: smallprint printgap noloewdin
keywords: NOSOSCF
formula: C14H21NOS
InChI: InChI=1/C14H21NOS/c1-3-10-15(11-4-2)14(16)17-12-13-8-6-5-7-9-13/h5-9H,3-4,10-12H2,1-2H3
38 atoms
S  0.270994 -0.272463 0.175291
O  -0.786894 1.883691 -0.891452
N  -2.276309 0.515337 0.122155
C  -3.377236 1.433284 -0.152968
C  -2.609284 -0.691018 0.865063
C  -3.533392 2.52258 0.900029
C  -3.266385 -1.773979 0.018246
C  -1.042509 0.860666 -0.272622
C  -4.694879 3.445971 0.567255
C  -2.377973 -2.354435 -1.070108
C  1.695559 0.584169 -0.571591
C  2.910288 -0.243412 -0.277456
C  3.245779 -1.321664 -1.092704
C  3.707055 0.042247 0.827389
C  4.36684 -2.091426 -0.816211
C  4.830218 -0.725303 1.10449
C  5.16319 -1.793545 0.282554
H  -4.2913 0.840416 -0.203709
H  -3.246837 1.875067 -1.141146
H  -3.282865 -0.401267 1.674556
H  -1.720317 -1.087139 1.358466
H  -3.694428 2.061152 1.877874
H  -2.609399 3.100749 0.972626
H  -3.57786 -2.567774 0.701119
H  -4.185789 -1.381725 -0.424441
H  -5.635223 2.896008 0.500183
H  -4.817566 4.215917 1.328943
H  -4.539102 3.950526 -0.387859
H  -2.051564 -1.595924 -1.782535
H  -1.48593 -2.822697 -0.65319
H  -2.916248 -3.116239 -1.634703
H  1.534546 0.67738 -1.644595
H  1.787609 1.579617 -0.140498
H  2.629038 -1.555417 -1.95272
H  3.451052 0.875835 1.4706
H  4.620593 -2.922588 -1.461284
H  5.447047 -0.487031 1.961331
H  6.040346 -2.390902 0.495375
elementType: S O N C H
totalener: -1074.41234198 hartree
nucrepener: 1313.03897117 hartree
electener: -2387.45131315 hartree
oneelecener: -4074.61418998 hartree
twoeener: 1687.16287682 hartree
cpcmener: -0.02558679 hartree
kineticenergy: 1070.55161020 hartree
xcener: -87.039401503487 hartree
chargesum: -0.0000000
charge: -0.116699 -0.555572 -0.124378 -0.056576 -0.078366 -0.075305 -0.080528 0.330538 -0.275035 -0.286180 -0.048145 0.013316 -0.201669 -0.189243 -0.151484 -0.151834 -0.167551 0.107444 0.092779 0.113374 0.104856 0.063108 0.063231 0.072176 0.065949 0.081968 0.092384 0.082938 0.081555 0.080891 0.098082 0.122293 0.118595 0.145023 0.144676 0.161170 0.160860 0.161361
qa: -0.1167 -0.5556 -0.1244 -0.0566 -0.0784 -0.0753 -0.0805 0.3305 -0.2750 -0.2862 -0.0481 0.0133 -0.2017 -0.1892 -0.1515 -0.1518 -0.1676 0.1074 0.0928 0.1134 0.1049 0.0631 0.0632 0.0722 0.0659 0.0820 0.0924 0.0829 0.0816 0.0809 0.0981 0.1223 0.1186 0.1450 0.1447 0.1612 0.1609 0.1614
va: 2.3566 1.9412 3.1922 3.8373 3.8970 3.8563 3.8409 4.2451 3.9421 3.9413 3.8748 3.6279 3.9470 3.9416 3.8880 3.8863 3.8927 0.9986 1.0201 1.0026 1.0087 1.0139 1.0191 1.0133 1.0102 1.0011 1.0029 1.0007 1.0021 1.0017 1.0062 1.0111 1.0140 1.0052 1.0034 0.9897 0.9899 0.9891
dispcorr: -0.015690255 hartree
energy: -1074.428032238732
dipole: -21.31971 20.35358 -0.96613 1.27641 -2.30963 -1.03322 1.01810 -0.26209 0.75601
magnitude: 1.60391 au
magnitude: 4.07680 debye
