program: Orca
programVersion: 5.0.2
elementType: S O N C C C C C C C C C C C C C C H H H H H H H H H H H H H H H H H H H H H
charge: 0
multiplicity: 1
keywords: wb97x-d3
keywords: def2-TZVPP
keywords: def2/J RIJCOSX
keywords: DEFGRID2
keywords: scfconv7
keywords: smallprint printgap noloewdin
keywords: NOSOSCF
formula: C14H21NOS
InChI: InChI=1/C14H21NOS/c1-3-10-15(11-4-2)14(16)17-12-13-8-6-5-7-9-13/h5-9H,3-4,10-12H2,1-2H3
38 atoms
S  0.151367 -0.2675 0.107699
O  -1.001736 1.62676 -1.295073
N  -2.413379 0.458815 0.042668
C  -3.554095 1.3106 -0.285665
C  -2.678927 -0.626655 0.976777
C  -3.844377 2.366982 0.773467
C  -3.353637 -1.833854 0.339406
C  -1.209922 0.738631 -0.480672
C  -2.714837 3.357624 1.003449
C  -2.523397 -2.537173 -0.721477
C  1.515137 0.442508 -0.870264
C  2.783001 -0.214631 -0.412309
C  3.179132 -1.440062 -0.942314
C  3.573571 0.386282 0.563302
C  4.351353 -2.047034 -0.514152
C  4.747133 -0.218181 0.991576
C  5.138696 -1.437209 0.454055
H  -4.426654 0.666775 -0.405435
H  -3.384976 1.779916 -1.252879
H  -3.315506 -0.231715 1.770901
H  -1.757094 -0.931011 1.474434
H  -4.742403 2.900797 0.452365
H  -4.10686 1.880672 1.716954
H  -3.585262 -2.531515 1.147757
H  -4.316999 -1.534515 -0.081495
H  -1.813606 2.871096 1.379294
H  -2.452024 3.888366 0.0873
H  -3.006118 4.104155 1.742949
H  -2.27871 -1.878024 -1.555326
H  -1.585666 -2.913752 -0.311948
H  -3.069775 -3.387116 -1.131405
H  1.333701 0.252293 -1.927218
H  1.555097 1.518018 -0.707132
H  2.568251 -1.919268 -1.698284
H  3.272204 1.338425 0.98338
H  4.650853 -2.996871 -0.937621
H  5.357688 0.2652 1.74311
H  6.055513 -1.907752 0.784535
elementType: S O N C H
totalener: -1074.41094558 hartree
nucrepener: 1329.57739974 hartree
electener: -2403.98834532 hartree
oneelecener: -4107.77000170 hartree
twoeener: 1703.78165639 hartree
cpcmener: -0.02567893 hartree
kineticenergy: 1070.55290627 hartree
xcener: -87.041224722268 hartree
chargesum: 0.0000000
charge: -0.116547 -0.550118 -0.114164 -0.059063 -0.082608 -0.092525 -0.077296 0.318697 -0.276616 -0.285809 -0.046974 0.010530 -0.198911 -0.193100 -0.151907 -0.151558 -0.167723 0.108617 0.099912 0.113895 0.106117 0.072004 0.063238 0.071491 0.064255 0.078588 0.083020 0.096002 0.082594 0.080690 0.098384 0.124603 0.116292 0.146350 0.144829 0.161075 0.161816 0.161918
qa: -0.1165 -0.5501 -0.1142 -0.0591 -0.0826 -0.0925 -0.0773 0.3187 -0.2766 -0.2858 -0.0470 0.0105 -0.1989 -0.1931 -0.1519 -0.1516 -0.1677 0.1086 0.0999 0.1139 0.1061 0.0720 0.0632 0.0715 0.0643 0.0786 0.0830 0.0960 0.0826 0.0807 0.0984 0.1246 0.1163 0.1463 0.1448 0.1611 0.1618 0.1619
va: 2.3558 1.9440 3.1710 3.8537 3.8982 3.8669 3.8420 4.2531 3.9275 3.9424 3.8750 3.6322 3.9446 3.9449 3.8882 3.8851 3.8940 1.0032 1.0232 1.0037 1.0084 1.0130 1.0095 1.0136 1.0097 1.0021 1.0056 1.0059 1.0014 1.0030 1.0063 1.0095 1.0146 1.0049 1.0032 0.9899 0.9897 0.9891
dispcorr: -0.016525247 hartree
energy: -1074.427470826359
dipole: -17.96482 17.01691 -0.94791 0.87291 -1.75933 -0.88642 3.27360 -2.29148 0.98212
magnitude: 1.62752 au
magnitude: 4.13683 debye
