program: Orca
programVersion: 5.0.2
elementType: S O N C C C C C C C C C C C C C C H H H H H H H H H H H H H H H H H H H H H
charge: 0
multiplicity: 1
keywords: wb97x-d3
keywords: def2-TZVPP
keywords: def2/J RIJCOSX
keywords: DEFGRID2
keywords: scfconv7
keywords: smallprint printgap noloewdin
keywords: NOSOSCF
formula: C14H21NOS
InChI: InChI=1/C14H21NOS/c1-3-10-15(11-4-2)14(16)17-12-13-8-6-5-7-9-13/h5-9H,3-4,10-12H2,1-2H3
38 atoms
S  -0.325382 -1.446395 -1.5554
O  -0.267988 1.162409 -1.911155
N  -1.943449 0.440902 -0.575793
C  -2.317863 1.809353 -0.210657
C  -2.701202 -0.664378 -0.001278
C  -1.248022 2.622609 0.516847
C  -2.235684 -1.118688 1.372679
C  -0.870586 0.259756 -1.353763
C  -0.602939 1.928401 1.704423
C  -3.042818 -2.314217 1.853118
C  1.457141 -1.136913 -1.771385
C  2.073839 -0.521571 -0.550394
C  2.144604 -1.238762 0.643665
C  2.562556 0.780868 -0.579622
C  2.690967 -0.66489 1.781002
C  3.106558 1.359461 0.560434
C  3.17044 0.639624 1.744271
H  -3.193977 1.718634 0.430169
H  -2.642005 2.35345 -1.101243
H  -2.701365 -1.506547 -0.696408
H  -3.743425 -0.344003 0.048299
H  -0.474253 2.942555 -0.180099
H  -1.742365 3.537336 0.853752
H  -1.17394 -1.37404 1.332174
H  -2.335956 -0.296071 2.082936
H  0.13354 2.582024 2.172861
H  -1.337794 1.664937 2.466654
H  -0.084233 1.013083 1.412809
H  -2.917983 -3.172306 1.190479
H  -2.732608 -2.621496 2.851801
H  -4.108821 -2.083881 1.897263
H  1.867486 -2.13036 -1.961467
H  1.63072 -0.538565 -2.663844
H  1.765479 -2.253322 0.68306
H  2.521661 1.347789 -1.500963
H  2.743715 -1.236282 2.698746
H  3.478218 2.375187 0.520807
H  3.593471 1.089064 2.633221
elementType: S O N C H
totalener: -1074.40729672 hartree
nucrepener: 1417.18740707 hartree
electener: -2491.59470380 hartree
oneelecener: -4283.34012995 hartree
twoeener: 1791.74542615 hartree
cpcmener: -0.02485873 hartree
kineticenergy: 1070.56190792 hartree
xcener: -87.042489665783 hartree
chargesum: 0.0000000
charge: -0.132946 -0.530463 -0.107981 -0.084124 -0.077370 -0.080707 -0.075986 0.305594 -0.274930 -0.282250 -0.057496 0.074570 -0.243538 -0.208647 -0.118640 -0.137080 -0.194557 0.103292 0.112178 0.100621 0.109681 0.069547 0.078766 0.057575 0.077988 0.109037 0.098178 0.032501 0.084365 0.092496 0.084525 0.145242 0.117198 0.138015 0.137388 0.159831 0.159066 0.159057
qa: -0.1329 -0.5305 -0.1080 -0.0841 -0.0774 -0.0807 -0.0760 0.3056 -0.2749 -0.2822 -0.0575 0.0746 -0.2435 -0.2086 -0.1186 -0.1371 -0.1946 0.1033 0.1122 0.1006 0.1097 0.0695 0.0788 0.0576 0.0780 0.1090 0.0982 0.0325 0.0844 0.0925 0.0845 0.1452 0.1172 0.1380 0.1374 0.1598 0.1591 0.1591
va: 2.2815 1.9785 3.1343 3.8802 3.8761 3.7882 3.8417 4.2839 3.9491 3.9679 3.8334 3.4735 3.9516 3.9136 3.8439 3.8488 3.9031 0.9999 1.0050 0.9963 0.9986 1.0284 1.0135 1.0173 1.0106 1.0038 1.0026 1.0010 1.0016 1.0023 1.0011 1.0012 1.0297 1.0123 1.0169 0.9890 0.9907 0.9907
dispcorr: -0.020882203 hartree
energy: -1074.428178927222
dipole: -10.50106 9.55755 -0.94351 2.75101 -3.25203 -0.50101 14.61020 -13.22412 1.38609
magnitude: 1.74999 au
magnitude: 4.44812 debye
