program: Gaussian 09
title: 000056261
version: EM64L-G09RevD.01
frameworkgroup: C1[X(C12H2Cl6O)]
method: RPBEPBE
basis: SDD
operation: Freq
keyword: #p
keyword: freq=noraman
keyword: PBEPBE/SDD
title: #p freq=noraman PBEPBE/SDD
converged: NO NO NO NO
title: Mulliken charges:
elementType: Cl Cl Cl Cl Cl Cl O C C C C C C C C C C C C H H
charge: 0.059592 0.068689 0.001953 0.015366 0.055241 0.067978 -0.215927 0.456826 0.403450 0.343378 0.338487 -0.384290 -0.351360 -0.352542 -0.348168 -0.114190 -0.118779 -0.220253 -0.234934 0.263716 0.265767
chargesum: 0.00000
title: Mulliken charges with hydrogens summed into heavy atoms:
elementType: Cl Cl Cl Cl Cl Cl O C C C C C C C C C C C C
charge: 0.059592 0.068689 0.001953 0.015366 0.055241 0.067978 -0.215927 0.456826 0.403450 0.343378 0.338487 -0.384290 -0.351360 -0.352542 -0.348168 -0.114190 -0.118779 0.043463 0.030833
polarizability: 2.91453829e+02 6.83563056e-01 2.50699914e+02 -1.36571171e-02 6.57833224e-04 6.59253502e+01
1716.lowfreq: -2.6789 -0.0012 0.0023 0.0023 3.2017 5.3912 19.8138 47.6015 73.8770
frequency: 19.7148 47.5995 73.8750 85.1157 97.0953 106.5581 160.5312 171.7761 192.3796 196.4984 210.6548 234.2526 258.6940 299.3626 305.9806 313.1863 336.1467 340.2240 354.8966 372.6875 425.5429 476.0591 537.0574 554.5131 564.7118 594.2520 604.1660 637.9883 638.4634 680.6661 736.6450 756.0138 770.8106 783.4589 807.0557 867.6612 909.3905 935.7228 935.8870 1043.3594 1117.8367 1133.0662 1200.1797 1226.6621 1241.0317 1308.5968 1324.4048 1365.9461 1382.8091 1405.6042 1455.9860 1530.5011 1561.6011 1585.4517 1623.1250 3167.8322 3186.2932
redmass: 30.6895 23.5836 18.6089 10.3376 15.0496 27.0691 27.9632 25.1081 24.8545 11.6391 29.7085 32.4243 9.6544 17.7467 7.5636 28.6862 27.6486 21.4595 8.3993 11.1168 9.0914 11.1408 5.3864 10.3570 5.6949 11.8741 10.4669 9.6812 10.4552 10.5845 9.7586 12.8297 11.6775 11.5854 1.3284 10.9684 8.6667 1.3408 12.5172 11.2342 2.4880 3.7985 2.9248 2.5045 4.8375 8.4242 4.7989 9.6862 11.0261 10.6907 3.1770 11.2760 8.2674 11.1563 10.9116 1.0889 1.0973
irintensity: 0.0021 0.0564 0.2876 0.6135 0.2892 0.2482 0.1092 0.1261 0.1098 0.1257 0.0002 0.0156 0.1407 1.3072 0.4882 0.0127 0.3086 2.5638 2.4639 0.0346 0.2208 15.3874 2.4675 13.3816 8.3188 28.9143 1.1636 3.3723 1.6917 19.0698 0.7186 37.9183 14.6479 0.5282 42.6443 30.8558 42.6596 0.0199 33.1541 71.5799 45.4747 110.7073 15.3678 24.4665 33.2162 89.3712 117.2818 27.6789 46.2732 2.7007 80.0863 4.2749 10.8138 25.5287 3.7509 0.4608 0.1045
temp: 298.150 k
press: 1.00000 atm
elementType: 17 17 17 17 17 17 8 6 6 6 6 6 6 6 6 6 6 6 6 1 1
symmnumber: 1
zpe: 270676.5 jmol-1
zpe.correction: 0.103095 hartree
zpe.thermalcorrener: 0.119904 hartree
zpe.thermalcorrenthalpy: 0.120849 hartree
zpe.thermalcorrgfe: 0.056082 hartree
zpe.sumelectzpe: -3292.729486 hartree
zpe.sumelectthermal: -3292.712677 hartree
zpe.sumelectthermalent: -3292.711733 hartree
zpe.sumelectthermalfe: -3292.776499 hartree
dipole: -2.5191 0.6797 0.0003
dipole: 2.6092
quadrupole: -137.1923 -154.5867 -149.7227
quadrupole: -4.6326 -0.0014 0.0014
quadrupole: 9.9749 -7.4194 -2.5555 -4.6326 -0.0014 0.0014
hfenergy: -3292.8325813 hartree
pointgroup: C01 [X(C12H2Cl6O1)]
dipole: 0.9990332 0.2360141 -0.0001351 debye
dipolederiv: -0.0313251 -0.0670342 0.0000653 0.0397588 -0.6146418 0.000729 -0.000083 0.0007444 0.0152975 -0.0205075 -0.0410926 0.0000129 -0.1173276 -0.6209482 0.0001697 0.0000807 0.0000964 0.0278172 -0.0900558 0.0896731 0.0001226 -0.0606919 -0.7048351 -0.0008019 -0.0000597 -0.0008242 -0.0236999 -0.1572695 0.1689554 0.0000686 0.2989377 -0.6285179 -0.0002165 0.000114 -0.0001289 -0.0075539 -0.4870582 0.2827816 -0.0000817 0.3535237 -0.2041777 0.0000522 -0.0001322 0.0001421 0.0107875 -0.6807523 -0.2444579 0.0002101 -0.2924025 -0.0956062 0.0001031 0.0002965 0.0000577 0.0197344 -1.3084185 -0.0355535 0.0000035 -0.0540646 -0.405994 -0.000012 -0.0000529 -0.000015 -0.1216007 0.1254057 -0.1230599 0.0001627 0.2458526 -0.247087 0.0003139 0.0003813 0.0003447 0.0481965 0.1456415 0.2046448 0.000212 -0.2002953 -0.2833299 -0.0002895 0.000238 -0.000375 0.0372035 0.731153 -0.1681728 -0.0001319 -0.6038382 -0.0248283 0.0000532 -0.0001787 0.0000831 0.1315899 0.546585 0.2263734 -0.0000688 0.7079626 0.0465543 -0.0001146 -0.0000867 -0.0000843 0.1235009 0.0830613 0.2607369 -0.0001759 -0.0401472 0.9162706 -0.0013727 -0.0001369 -0.0014151 -0.061518 -0.2311992 0.125569 0.0000532 0.1534152 0.9661698 -0.0001202 0.000018 -0.0000992 -0.0871366 0.202135 -0.2858533 -0.000406 0.2307541 1.0683488 0.0015198 -0.0000781 0.0016067 -0.0756848 0.1210299 -0.3678309 -0.0001293 -0.5605647 0.9688044 0.0002474 -0.0001158 0.0001905 -0.112255 0.4302674 -0.6345505 0.0002787 -0.7410526 0.0280583 0.0002156 0.0003793 0.0002443 -0.0305887 0.8101516 0.3839663 -0.0004066 0.529229 0.0473928 -0.0001856 -0.0005891 -0.0001816 -0.0280615 -0.1335443 0.1665486 0.0001847 0.0857915 -0.2303439 -0.0002392 0.0000507 -0.0003348 -0.1100496 -0.0860966 0.0642077 -0.00001 0.053186 -0.083024 0.0000801 -0.0000776 0.0001485 -0.0902171 0.0333329 -0.0408342 -0.000011 -0.05603 0.0151268 -0.0000777 0.0000002 -0.0001994 0.1654048 -0.0025366 0.034983 0.0000467 0.0280036 0.0866082 -0.0000541 0.000032 -0.0000011 0.1688337 unknown
polarizability: 291.3701656|-1.9672039|250.7835775|-0.0136711|-0.0002267|65.9253502 unknown
InChI: InChI=1S/C12H2Cl6O/c13-3-1-2-4(14)11-5(3)6-7(15)8(16)9(17)10(18)12(6)19-11/h1-2H
charge 0 multiplicity 1
21 atoms
Cl -1.29726 3.12559 -0.002848
Cl -1.991296 -3.288685 0.000678
Cl 1.905441 3.3805 0.002992
Cl 3.478369 -2.878113 -0.000922
Cl -4.176595 1.849157 -0.000641
Cl -4.597662 -1.317332 0.000997
O  0.616865 -1.686471 -0.000097
C  -0.288459 0.484547 -0.000131
C  1.192202 0.599627 0.000113
C  -0.555552 -0.921701 0.000057
C  1.669006 -0.756689 -0.000187
C  -1.429684 1.334485 -0.000726
C  -1.827927 -1.504014 0.000345
C  2.209344 1.597035 0.000725
C  3.015875 -1.13701 -0.000512
C  -2.731741 0.771708 -0.00026
C  -2.936589 -0.635287 0.000369
C  3.572095 1.231944 0.000268
C  3.984268 -0.12038 -0.000445
H  4.32776 2.021954 0.000675
H  5.048038 -0.371865 -0.000751
