program: Orca
programVersion: 5.0.2
elementType: S O N C C C C C C C C C C C C C C H H H H H H H H H H H H H H H H H H H H H
charge: 0
multiplicity: 1
keywords: wb97x-d3
keywords: def2-TZVPP
keywords: def2/J RIJCOSX
keywords: DEFGRID2
keywords: scfconv7
keywords: smallprint printgap noloewdin
keywords: NOSOSCF
formula: C14H21NOS
InChI: InChI=1/C14H21NOS/c1-3-10-15(11-4-2)14(16)17-12-13-8-6-5-7-9-13/h5-9H,3-4,10-12H2,1-2H3
38 atoms
S  0.015295 -0.698446 1.392457
O  -0.163838 1.775786 0.475806
N  -1.958754 0.461485 0.061595
C  -2.701737 1.577522 -0.517048
C  -2.642314 -0.822898 0.168373
C  -3.487255 2.361705 0.525176
C  -2.26517 -1.827506 -0.913204
C  -0.735364 0.698668 0.554962
C  -4.24664 3.520271 -0.099974
C  -2.58319 -1.368471 -2.327224
C  1.701752 -0.078873 1.684899
C  2.652957 -0.473087 0.596197
C  2.79995 0.30162 -0.552765
C  3.398054 -1.643188 0.716438
C  3.671896 -0.089288 -1.558807
C  4.271682 -2.034863 -0.288316
C  4.409685 -1.259231 -1.431271
H  -3.382219 1.168412 -1.264085
H  -2.015588 2.232882 -1.053008
H  -3.71232 -0.615829 0.118511
H  -2.480577 -1.253915 1.159037
H  -4.185599 1.688741 1.030214
H  -2.803505 2.736798 1.290336
H  -1.204792 -2.075801 -0.833603
H  -2.812028 -2.748297 -0.6960
H  -4.953718 3.173044 -0.855374
H  -4.813145 4.069769 0.651796
H  -3.567919 4.225911 -0.581883
H  -2.334902 -2.148237 -3.04781
H  -3.643474 -1.137851 -2.445048
H  -2.015708 -0.480319 -2.607538
H  1.655823 0.99938 1.825879
H  2.000052 -0.520358 2.635441
H  2.233639 1.217406 -0.662845
H  3.29496 -2.252095 1.606876
H  3.77809 0.524597 -2.443881
H  4.845728 -2.945545 -0.176764
H  5.090794 -1.561763 -2.215915
elementType: S O N C H
totalener: -1074.41087630 hartree
nucrepener: 1337.81303627 hartree
electener: -2412.22391257 hartree
oneelecener: -4124.35758484 hartree
twoeener: 1712.13367227 hartree
cpcmener: -0.02377531 hartree
kineticenergy: 1070.56272495 hartree
xcener: -87.040564411910 hartree
chargesum: -0.0000000
charge: -0.120215 -0.553151 -0.121729 -0.058380 -0.081600 -0.077970 -0.090018 0.321975 -0.275632 -0.276766 -0.061266 0.031726 -0.195249 -0.217636 -0.152853 -0.141578 -0.179429 0.109747 0.094350 0.113484 0.106209 0.065079 0.064939 0.059821 0.070290 0.081402 0.092237 0.083475 0.097642 0.086757 0.080201 0.128305 0.142963 0.148021 0.142314 0.161257 0.160208 0.161070
qa: -0.1202 -0.5532 -0.1217 -0.0584 -0.0816 -0.0780 -0.0900 0.3220 -0.2756 -0.2768 -0.0613 0.0317 -0.1952 -0.2176 -0.1529 -0.1416 -0.1794 0.1097 0.0943 0.1135 0.1062 0.0651 0.0649 0.0598 0.0703 0.0814 0.0922 0.0835 0.0976 0.0868 0.0802 0.1283 0.1430 0.1480 0.1423 0.1613 0.1602 0.1611
va: 2.3196 1.9373 3.1634 3.8241 3.8805 3.8676 3.8634 4.2546 3.9451 3.9243 3.7552 3.5978 3.9286 3.9797 3.9111 3.8733 3.9049 0.9931 1.0214 0.9947 1.0085 1.0130 1.0174 1.0259 1.0153 1.0011 1.0030 1.0004 1.0066 0.9981 1.0026 1.0332 1.0048 1.0193 1.0044 0.9906 0.9894 0.9895
dispcorr: -0.016323916 hartree
energy: -1074.427200218572
dipole: -19.75710 18.54220 -1.21489 3.83354 -4.86362 -1.03009 -8.31459 8.08494 -0.22965
magnitude: 1.60928 au
magnitude: 4.09047 debye
