program: Orca
programVersion: 5.0.2
elementType: S O N C C C C C C C C C C C C C C H H H H H H H H H H H H H H H H H H H H H
charge: 0
multiplicity: 1
keywords: wb97x-d3
keywords: def2-TZVPP
keywords: def2/J RIJCOSX
keywords: DEFGRID2
keywords: scfconv7
keywords: smallprint printgap noloewdin
keywords: NOSOSCF
formula: C14H21NOS
InChI: InChI=1/C14H21NOS/c1-3-10-15(11-4-2)14(16)17-12-13-8-6-5-7-9-13/h5-9H,3-4,10-12H2,1-2H3
38 atoms
S  -0.203941 -1.687278 0.836267
O  -0.255943 -0.743781 -1.61695
N  -1.8401 0.113923 -0.240384
C  -2.299408 1.067137 -1.248396
C  -2.487581 0.166919 1.06573
C  -1.701979 2.45706 -1.059198
C  -3.492182 -0.951295 1.313701
C  -0.796398 -0.677318 -0.523304
C  -0.183808 2.520257 -1.14065
C  -4.630757 -0.992318 0.307854
C  1.487516 -2.003394 0.24697
C  2.320566 -0.756605 0.194683
C  2.813556 -0.281928 -1.016007
C  2.599991 -0.04278 1.358962
C  3.560958 0.888445 -1.067112
C  3.347326 1.123671 1.310999
C  3.825936 1.597496 0.094972
H  -3.386187 1.12498 -1.183635
H  -2.066348 0.682387 -2.239482
H  -2.99875 1.128296 1.126365
H  -1.732224 0.180911 1.853974
H  -2.138488 3.098647 -1.828743
H  -2.03465 2.867795 -0.101814
H  -2.984392 -1.919187 1.33692
H  -3.894974 -0.798883 2.318407
H  0.157424 3.551706 -1.044629
H  0.295995 1.952829 -0.341146
H  0.187675 2.139944 -2.092906
H  -4.277173 -1.206185 -0.701608
H  -5.347449 -1.771245 0.569402
H  -5.171571 -0.044573 0.277213
H  1.884815 -2.711468 0.977055
H  1.457508 -2.514469 -0.713639
H  2.614121 -0.828997 -1.928726
H  2.224847 -0.398839 2.311092
H  3.933361 1.245219 -2.018514
H  3.557565 1.664698 2.224397
H  4.405816 2.510408 0.05689
elementType: S O N C H
totalener: -1074.40962916 hartree
nucrepener: 1393.27726670 hartree
electener: -2467.68689586 hartree
oneelecener: -4235.69053596 hartree
twoeener: 1768.00364010 hartree
cpcmener: -0.02564491 hartree
kineticenergy: 1070.56451201 hartree
xcener: -87.043520172412 hartree
chargesum: -0.0000000
charge: -0.120511 -0.540308 -0.112524 -0.063142 -0.092367 -0.092466 -0.091221 0.305380 -0.258874 -0.275066 -0.048073 0.047852 -0.202149 -0.208954 -0.151815 -0.145683 -0.176502 0.112039 0.102125 0.111190 0.112682 0.073952 0.063729 0.061563 0.073689 0.100175 0.055440 0.082215 0.079255 0.098266 0.087363 0.146081 0.115779 0.137823 0.133721 0.158635 0.160286 0.160414
qa: -0.1205 -0.5403 -0.1125 -0.0631 -0.0924 -0.0925 -0.0912 0.3054 -0.2589 -0.2751 -0.0481 0.0479 -0.2021 -0.2090 -0.1518 -0.1457 -0.1765 0.1120 0.1021 0.1112 0.1127 0.0740 0.0637 0.0616 0.0737 0.1002 0.0554 0.0822 0.0793 0.0983 0.0874 0.1461 0.1158 0.1378 0.1337 0.1586 0.1603 0.1604
va: 2.3147 1.9585 3.1173 3.8379 3.8530 3.8932 3.8615 4.2838 3.9251 3.9227 3.8151 3.5026 3.9111 3.9569 3.8748 3.8827 3.8959 0.9994 1.0235 0.9977 1.0188 1.0134 1.0108 1.0210 1.0156 1.0071 1.0036 1.0058 1.0026 1.0061 0.9983 1.0015 1.0321 1.0155 1.0149 0.9908 0.9896 0.9896
dispcorr: -0.019298213 hartree
energy: -1074.428927370171
dipole: -14.41902 13.43718 -0.98183 9.76366 -8.96333 0.80033 -0.69030 1.85670 1.16639
magnitude: 1.72192 au
magnitude: 4.37677 debye
