program: Orca
programVersion: 5.0.2
elementType: S O N C C C C C C C C C C C C C C H H H H H H H H H H H H H H H H H H H H H
charge: 0
multiplicity: 1
keywords: wb97x-d3
keywords: def2-TZVPP
keywords: def2/J RIJCOSX
keywords: DEFGRID2
keywords: scfconv7
keywords: smallprint printgap noloewdin
keywords: NOSOSCF
formula: C14H21NOS
InChI: InChI=1/C14H21NOS/c1-3-10-15(11-4-2)14(16)17-12-13-8-6-5-7-9-13/h5-9H,3-4,10-12H2,1-2H3
38 atoms
S  -0.050454 -1.345747 0.402703
O  -0.341915 1.001904 1.595045
N  -1.990098 0.441249 0.152169
C  -2.749688 1.647403 0.461259
C  -2.552184 -0.453131 -0.847579
C  -2.348274 2.841127 -0.394228
C  -3.492532 -1.502403 -0.27049
C  -0.8304 0.226726 0.791834
C  -3.194729 4.064609 -0.079949
C  -4.062846 -2.393059 -1.362295
C  1.513996 -1.207076 1.32092
C  2.655043 -0.750285 0.462701
C  3.543362 -1.678966 -0.072674
C  2.845675 0.601129 0.179681
C  4.602676 -1.269544 -0.871694
C  3.903177 1.011812 -0.617944
C  4.786417 0.077974 -1.145724
H  -2.64197 1.884586 1.519964
H  -3.804999 1.41436 0.304177
H  -1.749499 -0.928166 -1.415931
H  -3.089009 0.166455 -1.569598
H  -1.292405 3.068181 -0.228975
H  -2.451655 2.580881 -1.451342
H  -2.959027 -2.10959 0.46505
H  -4.304785 -1.004302 0.26606
H  -4.255124 3.874607 -0.256754
H  -3.083876 4.36971 0.962294
H  -2.906161 4.913059 -0.701009
H  -4.743387 -3.137646 -0.94869
H  -4.620784 -1.813237 -2.100254
H  -3.273265 -2.928817 -1.892613
H  1.349786 -0.54738 2.172035
H  1.703076 -2.2058 1.715351
H  3.408468 -2.733337 0.139666
H  2.165546 1.33817 0.588355
H  5.286119 -2.005072 -1.276881
H  4.041187 2.065529 -0.824902
H  5.613962 0.400136 -1.764837
elementType: S O N C H
totalener: -1074.42401275 hartree
nucrepener: 1320.65438243 hartree
electener: -2395.07839518 hartree
oneelecener: -4089.84589545 hartree
twoeener: 1694.76750027 hartree
cpcmener: -0.01947983 hartree
kineticenergy: 1070.54678388 hartree
xcener: -87.035572270017 hartree
chargesum: 0.0000000
charge: -0.122229 -0.519210 -0.117030 -0.057643 -0.100229 -0.075425 -0.068473 0.303086 -0.274130 -0.273501 -0.067910 0.033813 -0.211444 -0.193019 -0.139749 -0.151404 -0.175117 0.094455 0.104995 0.104346 0.112459 0.064540 0.061726 0.056415 0.067861 0.080511 0.083455 0.091744 0.092663 0.081791 0.083481 0.132033 0.138088 0.137834 0.150672 0.156807 0.156285 0.157455
qa: -0.1222 -0.5192 -0.1170 -0.0576 -0.1002 -0.0754 -0.0685 0.3031 -0.2741 -0.2735 -0.0679 0.0338 -0.2114 -0.1930 -0.1397 -0.1514 -0.1751 0.0945 0.1050 0.1043 0.1125 0.0645 0.0617 0.0564 0.0679 0.0805 0.0835 0.0917 0.0927 0.0818 0.0835 0.1320 0.1381 0.1378 0.1507 0.1568 0.1563 0.1575
va: 2.3138 1.9794 3.1835 3.8404 3.8817 3.8601 3.8350 4.2780 3.9415 3.9410 3.7609 3.6131 3.9824 3.9314 3.8806 3.9179 3.9096 1.0196 0.9968 1.0148 0.9948 1.0188 1.0139 1.0282 1.0146 1.0017 1.0008 1.0031 1.0033 1.0018 1.0010 1.0327 1.0060 1.0053 1.0156 0.9906 0.9924 0.9905
dispcorr: -0.015562291 hartree
energy: -1074.439575044627
dipole: -20.18804 19.13951 -1.04853 6.27608 -6.66154 -0.38546 -6.27509 5.31655 -0.95853
magnitude: 1.47200 au
magnitude: 3.74153 debye
