program: Orca
programVersion: 5.0.2
elementType: S O N C C C C C C C C C C C C C C H H H H H H H H H H H H H H H H H H H H H
charge: 0
multiplicity: 1
keywords: wb97x-d3
keywords: def2-TZVPP
keywords: def2/J RIJCOSX
keywords: DEFGRID2
keywords: scfconv7
keywords: smallprint printgap noloewdin
keywords: NOSOSCF
formula: C14H21NOS
InChI: InChI=1/C14H21NOS/c1-3-10-15(11-4-2)14(16)17-12-13-8-6-5-7-9-13/h5-9H,3-4,10-12H2,1-2H3
38 atoms
S  -0.28115 -1.64875 0.784274
O  -0.275374 -0.580751 -1.613802
N  -1.874708 0.242662 -0.237967
C  -2.267422 1.264203 -1.204076
C  -2.605309 0.233756 1.018944
C  -1.633462 2.6233 -0.921002
C  -3.952059 -0.474855 0.937795
C  -0.842615 -0.564074 -0.5372
C  -0.112142 2.633337 -0.921566
C  -3.862906 -1.956135 0.611354
C  1.399618 -1.99451 0.178382
C  2.277964 -0.778279 0.155468
C  2.775905 -0.285545 -1.046087
C  2.600283 -0.113295 1.337662
C  3.571434 0.852914 -1.070063
C  3.394706 1.02252 1.316444
C  3.879387 1.513364 0.110018
H  -3.354814 1.356845 -1.175367
H  -2.012007 0.926376 -2.20688
H  -2.759008 1.271209 1.323907
H  -1.992507 -0.214008 1.802441
H  -2.006916 3.31471 -1.681098
H  -1.998923 3.006934 0.035802
H  -4.445036 -0.33939 1.904137
H  -4.587969 0.028808 0.204461
H  0.260553 3.643166 -0.742393
H  0.301121 2.000224 -0.134386
H  0.297952 2.297752 -1.874788
H  -3.282086 -2.498892 1.358982
H  -4.857693 -2.403694 0.582159
H  -3.402765 -2.135069 -0.361897
H  1.775461 -2.735083 0.888536
H  1.3512 -2.480695 -0.794802
H  2.540661 -0.793422 -1.972711
H  2.221354 -0.483015 2.283394
H  3.946455 1.225089 -2.014982
H  3.636097 1.526986 2.243487
H  4.495366 2.403359 0.092164
elementType: S O N C H
totalener: -1074.42055135 hartree
nucrepener: 1395.10477563 hartree
electener: -2469.52532698 hartree
oneelecener: -4239.25772960 hartree
twoeener: 1769.73240262 hartree
cpcmener: -0.02025518 hartree
kineticenergy: 1070.55068600 hartree
xcener: -87.040352992473 hartree
chargesum: 0.0000000
charge: -0.122802 -0.498654 -0.113084 -0.057860 -0.086971 -0.095569 -0.074942 0.278825 -0.255708 -0.286706 -0.053597 0.049511 -0.183980 -0.209244 -0.150425 -0.145487 -0.171641 0.106424 0.100616 0.108247 0.104975 0.071272 0.060830 0.070201 0.062340 0.098313 0.058309 0.082929 0.082523 0.097844 0.085544 0.143706 0.115563 0.131611 0.130309 0.154389 0.156165 0.156222
qa: -0.1228 -0.4987 -0.1131 -0.0579 -0.0870 -0.0956 -0.0749 0.2788 -0.2557 -0.2867 -0.0536 0.0495 -0.1840 -0.2092 -0.1504 -0.1455 -0.1716 0.1064 0.1006 0.1082 0.1050 0.0713 0.0608 0.0702 0.0623 0.0983 0.0583 0.0829 0.0825 0.0978 0.0855 0.1437 0.1156 0.1316 0.1303 0.1544 0.1562 0.1562
va: 2.3126 2.0085 3.1297 3.8458 3.8781 3.8942 3.8453 4.3054 3.9262 3.9343 3.8241 3.5075 3.9151 3.9640 3.8835 3.8898 3.9003 1.0030 1.0239 1.0042 1.0219 1.0135 1.0091 1.0141 1.0101 1.0066 1.0045 1.0064 1.0017 1.0065 1.0016 1.0008 1.0308 1.0183 1.0158 0.9921 0.9909 0.9909
dispcorr: -0.019463746 hartree
energy: -1074.440015097522
dipole: -13.16843 12.19869 -0.96974 8.56381 -7.85629 0.70752 0.09200 0.88940 0.98140
magnitude: 1.55052 au
magnitude: 3.94112 debye
