program: Orca
programVersion: 5.0.2
elementType: S O N C C C C C C C C C C C C C C H H H H H H H H H H H H H H H H H H H H H
charge: 0
multiplicity: 1
keywords: wb97x-d3
keywords: def2-TZVPP
keywords: def2/J RIJCOSX
keywords: DEFGRID2
keywords: scfconv7
keywords: smallprint printgap noloewdin
keywords: NOSOSCF
formula: C14H21NOS
InChI: InChI=1/C14H21NOS/c1-3-10-15(11-4-2)14(16)17-12-13-8-6-5-7-9-13/h5-9H,3-4,10-12H2,1-2H3
38 atoms
S  -0.113519 -1.275764 0.281122
O  -0.469667 0.92146 1.710253
N  -2.118058 0.454544 0.225235
C  -2.931364 1.593842 0.638101
C  -2.679704 -0.404114 -0.805915
C  -2.82106 2.791273 -0.297751
C  -3.524384 -1.54875 -0.262285
C  -0.946578 0.218859 0.83695
C  -1.421676 3.375025 -0.406411
C  -4.081397 -2.403107 -1.389735
C  1.435418 -1.19184 1.231607
C  2.586226 -0.677707 0.420599
C  3.531336 -1.562256 -0.090039
C  2.726584 0.68352 0.154608
C  4.597983 -1.100508 -0.850376
C  3.790753 1.146274 -0.604056
C  4.730325 0.255527 -1.109629
H  -2.655715 1.880546 1.6517
H  -3.969863 1.257862 0.68136
H  -1.882872 -0.787202 -1.447811
H  -3.291817 0.225923 -1.454664
H  -3.185518 2.518061 -1.292252
H  -3.511477 3.553153 0.074218
H  -2.922536 -2.166189 0.408774
H  -4.343293 -1.142159 0.337416
H  -0.712914 2.658759 -0.825639
H  -1.420119 4.247911 -1.06076
H  -1.040788 3.692901 0.565358
H  -4.690697 -3.220173 -1.002649
H  -4.709017 -1.817088 -2.064103
H  -3.280814 -2.845094 -1.986161
H  1.252914 -0.58362 2.116882
H  1.626058 -2.210376 1.570213
H  3.433674 -2.623149 0.109398
H  2.001863 1.387035 0.546382
H  5.324919 -1.802481 -1.238952
H  3.889658 2.206531 -0.799573
H  5.561569 0.61829 -1.700669
elementType: S O N C H
totalener: -1074.42318398 hartree
nucrepener: 1338.61046155 hartree
electener: -2413.03364553 hartree
oneelecener: -4125.81665832 hartree
twoeener: 1712.78301280 hartree
cpcmener: -0.01945687 hartree
kineticenergy: 1070.54798752 hartree
xcener: -87.037584867224 hartree
chargesum: -0.0000000
charge: -0.121568 -0.512309 -0.110001 -0.058568 -0.101156 -0.095342 -0.068624 0.293463 -0.267701 -0.273804 -0.069885 0.036121 -0.210162 -0.194317 -0.138770 -0.151025 -0.175000 0.099440 0.107039 0.104686 0.112690 0.061122 0.070468 0.056704 0.068290 0.074782 0.095419 0.083360 0.092920 0.081660 0.083736 0.134497 0.135506 0.138076 0.147927 0.156693 0.156199 0.157432
qa: -0.1216 -0.5123 -0.1100 -0.0586 -0.1012 -0.0953 -0.0686 0.2935 -0.2677 -0.2738 -0.0699 0.0361 -0.2102 -0.1943 -0.1388 -0.1510 -0.1750 0.0994 0.1070 0.1047 0.1127 0.0611 0.0705 0.0567 0.0683 0.0748 0.0954 0.0834 0.0929 0.0817 0.0837 0.1345 0.1355 0.1381 0.1479 0.1567 0.1562 0.1574
va: 2.3172 1.9847 3.1646 3.8528 3.8786 3.8790 3.8314 4.2849 3.9278 3.9424 3.7591 3.6176 3.9791 3.9341 3.8812 3.9126 3.9086 1.0225 1.0019 1.0131 0.9955 1.0099 1.0133 1.0304 1.0143 1.0035 1.0060 1.0053 1.0035 1.0017 1.0009 1.0335 1.0073 1.0054 1.0133 0.9906 0.9925 0.9905
dispcorr: -0.016518212 hartree
energy: -1074.439702188894
dipole: -17.43340 16.31343 -1.11997 4.83549 -5.17495 -0.33946 -6.54625 5.60915 -0.93710
magnitude: 1.49924 au
magnitude: 3.81076 debye
