program: Orca
programVersion: 5.0.2
elementType: S O N C C C C C C C C C C C C C C H H H H H H H H H H H H H H H H H H H H H
charge: 0
multiplicity: 1
keywords: wb97x-d3
keywords: def2-TZVPP
keywords: def2/J RIJCOSX
keywords: DEFGRID2
keywords: scfconv7
keywords: smallprint printgap noloewdin
keywords: NOSOSCF
formula: C14H21NOS
InChI: InChI=1/C14H21NOS/c1-3-10-15(11-4-2)14(16)17-12-13-8-6-5-7-9-13/h5-9H,3-4,10-12H2,1-2H3
38 atoms
S  0.245745 -0.274614 0.070434
O  -0.908917 1.516582 -1.471773
N  -2.312874 0.454984 -0.046652
C  -3.445377 1.25544 -0.509011
C  -2.538196 -0.563666 0.970773
C  -3.49049 2.659651 0.081645
C  -2.724716 -1.972853 0.419564
C  -1.109601 0.698206 -0.590888
C  -3.589441 2.686462 1.5985
C  -3.907216 -2.119029 -0.524337
C  1.633435 0.459969 -0.854378
C  2.894615 -0.195121 -0.37498
C  3.428554 -1.287054 -1.052907
C  3.543364 0.273961 0.764755
C  4.599434 -1.888064 -0.611464
C  4.712602 -0.325956 1.208491
C  5.245048 -1.40813 0.519731
H  -4.352125 0.716149 -0.235002
H  -3.434764 1.307318 -1.598669
H  -3.427347 -0.270518 1.530005
H  -1.720757 -0.548186 1.696309
H  -2.617813 3.228585 -0.245039
H  -4.359841 3.162648 -0.351053
H  -1.810647 -2.300215 -0.081541
H  -2.855379 -2.637957 1.277464
H  -4.475793 2.155874 1.952449
H  -2.717145 2.233097 2.072472
H  -3.65561 3.712075 1.964448
H  -4.843053 -1.822066 -0.046622
H  -3.785702 -1.517374 -1.42638
H  -4.018892 -3.155938 -0.84413
H  1.4865 0.293438 -1.920474
H  1.655856 1.533139 -0.669378
H  2.928964 -1.66418 -1.937632
H  3.134507 1.120683 1.303694
H  5.00875 -2.730905 -1.153706
H  5.211054 0.054172 2.091106
H  6.160259 -1.873798 0.862337
elementType: S O N C H
totalener: -1074.42178211 hartree
nucrepener: 1321.26831990 hartree
electener: -2395.69010201 hartree
oneelecener: -4090.94228155 hartree
twoeener: 1695.25217954 hartree
cpcmener: -0.02039760 hartree
kineticenergy: 1070.54765236 hartree
xcener: -87.036696014025 hartree
chargesum: -0.0000000
charge: -0.117070 -0.518892 -0.123895 -0.071995 -0.097319 -0.091126 -0.090232 0.327005 -0.282910 -0.277453 -0.047384 0.011945 -0.185835 -0.196455 -0.149354 -0.148882 -0.163570 0.107491 0.102705 0.114190 0.108646 0.066813 0.071104 0.061488 0.069390 0.083807 0.080553 0.097292 0.085576 0.082956 0.097743 0.116531 0.121125 0.141915 0.141069 0.157179 0.157564 0.158285
qa: -0.1171 -0.5189 -0.1239 -0.0720 -0.0973 -0.0911 -0.0902 0.3270 -0.2829 -0.2775 -0.0474 0.0119 -0.1858 -0.1965 -0.1494 -0.1489 -0.1636 0.1075 0.1027 0.1142 0.1086 0.0668 0.0711 0.0615 0.0694 0.0838 0.0806 0.0973 0.0856 0.0830 0.0977 0.1165 0.1211 0.1419 0.1411 0.1572 0.1576 0.1583
va: 2.3563 1.9894 3.1148 3.8649 3.8695 3.8679 3.8741 4.2723 3.9278 3.9218 3.8759 3.6375 3.9490 3.9538 3.8931 3.8953 3.9002 0.9930 1.0159 0.9914 1.0123 1.0214 1.0130 1.0251 1.0155 0.9995 1.0012 1.0066 0.9989 1.0016 1.0068 1.0144 1.0107 1.0044 1.0064 0.9912 0.9911 0.9903
dispcorr: -0.016210164 hartree
energy: -1074.437992276500
dipole: -21.23795 20.43641 -0.80154 0.80257 -1.48529 -0.68272 4.35474 -3.40365 0.95109
magnitude: 1.41885 au
magnitude: 3.60644 debye
