program: Orca
programVersion: 5.0.2
elementType: S O N C C C C C C C C C C C C C C H H H H H H H H H H H H H H H H H H H H H
charge: 0
multiplicity: 1
keywords: wb97x-d3
keywords: def2-TZVPP
keywords: def2/J RIJCOSX
keywords: DEFGRID2
keywords: scfconv7
keywords: smallprint printgap noloewdin
keywords: NOSOSCF
formula: C14H21NOS
InChI: InChI=1/C14H21NOS/c1-3-10-15(11-4-2)14(16)17-12-13-8-6-5-7-9-13/h5-9H,3-4,10-12H2,1-2H3
38 atoms
S  0.154264 -0.265957 0.140512
O  -0.993963 1.59005 -1.316124
N  -2.413275 0.462269 0.047489
C  -3.54763 1.308443 -0.308895
C  -2.68614 -0.611812 0.989723
C  -3.863806 2.365914 0.743634
C  -3.365403 -1.821301 0.357927
C  -1.206072 0.727357 -0.481775
C  -2.719857 3.32344 1.034549
C  -2.554099 -2.506762 -0.728832
C  1.515475 0.422798 -0.856478
C  2.789209 -0.225756 -0.402414
C  3.189753 -1.451192 -0.929094
C  3.58656 0.386721 0.560418
C  4.373995 -2.04377 -0.514573
C  4.772055 -0.203272 0.975224
C  5.169682 -1.419996 0.437404
H  -4.41813 0.665605 -0.452243
H  -3.351734 1.780298 -1.269741
H  -3.322897 -0.210774 1.781205
H  -1.76647 -0.917942 1.490531
H  -4.732487 2.924816 0.385579
H  -4.182313 1.882039 1.671245
H  -3.574322 -2.528534 1.164783
H  -4.340528 -1.527672 -0.040024
H  -1.853827 2.807361 1.452378
H  -2.394216 3.850559 0.136491
H  -3.02501 4.075737 1.763335
H  -2.339458 -1.837039 -1.563084
H  -1.601899 -2.878143 -0.348352
H  -3.101749 -3.359133 -1.133485
H  1.325309 0.218536 -1.909447
H  1.556848 1.501386 -0.713325
H  2.574443 -1.940954 -1.675001
H  3.282077 1.337929 0.981115
H  4.677753 -2.992425 -0.938598
H  5.387685 0.290096 1.716528
H  6.096884 -1.878826 0.756139
elementType: S O N C H
totalener: -1074.42198103 hartree
nucrepener: 1329.27708587 hartree
electener: -2403.69906690 hartree
oneelecener: -4107.06627524 hartree
twoeener: 1703.36720834 hartree
cpcmener: -0.02059224 hartree
kineticenergy: 1070.54498741 hartree
xcener: -87.038393988648 hartree
chargesum: 0.0000000
charge: -0.120014 -0.512986 -0.117877 -0.062536 -0.087559 -0.094962 -0.078017 0.304882 -0.271567 -0.284383 -0.046955 0.011524 -0.194513 -0.188187 -0.149128 -0.149107 -0.163646 0.105997 0.101887 0.111153 0.106347 0.071020 0.061324 0.070777 0.063233 0.077067 0.084503 0.095142 0.083528 0.080984 0.097612 0.121808 0.115418 0.143016 0.141385 0.157128 0.157793 0.157907
qa: -0.1200 -0.5130 -0.1179 -0.0625 -0.0876 -0.0950 -0.0780 0.3049 -0.2716 -0.2844 -0.0470 0.0115 -0.1945 -0.1882 -0.1491 -0.1491 -0.1636 0.1060 0.1019 0.1112 0.1063 0.0710 0.0613 0.0708 0.0632 0.0771 0.0845 0.0951 0.0835 0.0810 0.0976 0.1218 0.1154 0.1430 0.1414 0.1571 0.1578 0.1579
va: 2.3498 1.9911 3.1542 3.8537 3.9029 3.8697 3.8395 4.2709 3.9280 3.9443 3.8777 3.6339 3.9503 3.9504 3.8952 3.8926 3.9003 1.0026 1.0242 1.0033 1.0084 1.0134 1.0085 1.0140 1.0087 1.0033 1.0063 1.0057 1.0011 1.0046 1.0063 1.0102 1.0147 1.0055 1.0042 0.9911 0.9910 0.9903
dispcorr: -0.016558763 hartree
energy: -1074.438539796358
dipole: -18.07201 17.17389 -0.89812 0.93258 -1.70272 -0.77014 3.19386 -2.31014 0.88372
magnitude: 1.47671 au
magnitude: 3.75351 debye
