program: Orca
programVersion: 5.0.2
elementType: S O N C C C C C C C C C C C C C C H H H H H H H H H H H H H H H H H H H H H
charge: 0
multiplicity: 1
keywords: wb97x-d3
keywords: def2-TZVPP
keywords: def2/J RIJCOSX
keywords: DEFGRID2
keywords: scfconv7
keywords: smallprint printgap noloewdin
keywords: NOSOSCF
formula: C14H21NOS
InChI: InChI=1/C14H21NOS/c1-3-10-15(11-4-2)14(16)17-12-13-8-6-5-7-9-13/h5-9H,3-4,10-12H2,1-2H3
38 atoms
S  0.203669 0.282159 -1.374774
O  -0.207196 1.673071 0.837264
N  -2.003042 0.526202 0.080908
C  -2.852589 1.118276 1.113328
C  -2.582614 -0.450444 -0.834111
C  -3.304809 2.537398 0.788017
C  -2.306303 -1.900241 -0.451929
C  -0.720623 0.919606 0.028838
C  -4.125892 2.644755 -0.4873
C  -2.871782 -2.302302 0.901443
C  1.879047 0.884155 -0.997291
C  2.711141 -0.140985 -0.288651
C  3.578744 -0.955326 -1.010936
C  2.621668 -0.312394 1.091455
C  4.341199 -1.923266 -0.371355
C  3.382597 -1.279056 1.731904
C  4.244045 -2.089112 1.002748
H  -2.331668 1.099124 2.071391
H  -3.723635 0.47243 1.222325
H  -2.244389 -0.256577 -1.854888
H  -3.658499 -0.275268 -0.851003
H  -3.896506 2.891827 1.636254
H  -2.437463 3.197551 0.726449
H  -2.743135 -2.528891 -1.232221
H  -1.230711 -2.089122 -0.475275
H  -3.558441 2.330533 -1.364929
H  -5.029481 2.033728 -0.436822
H  -4.438799 3.675214 -0.661059
H  -3.953074 -2.157555 0.945659
H  -2.675358 -3.356126 1.103093
H  -2.424584 -1.732259 1.717181
H  2.314966 1.135623 -1.96404
H  1.789364 1.80846 -0.428958
H  3.659818 -0.830769 -2.084661
H  1.954399 0.313979 1.67003
H  5.012763 -2.546336 -0.948339
H  3.304623 -1.39848 2.805163
H  4.838663 -2.842064 1.50403
elementType: S O N C H
totalener: -1074.42121150 hartree
nucrepener: 1349.10946082 hartree
electener: -2423.53067232 hartree
oneelecener: -4146.83361985 hartree
twoeener: 1723.30294753 hartree
cpcmener: -0.01889149 hartree
kineticenergy: 1070.55307689 hartree
xcener: -87.038178725066 hartree
chargesum: 0.0000000
charge: -0.123176 -0.518231 -0.122523 -0.069144 -0.092624 -0.090509 -0.089686 0.316823 -0.283610 -0.277069 -0.064878 0.029918 -0.212160 -0.192442 -0.137668 -0.147302 -0.177548 0.102130 0.106236 0.109019 0.112220 0.071951 0.066594 0.069748 0.060659 0.080578 0.083950 0.097326 0.085253 0.097452 0.082655 0.139622 0.130476 0.137997 0.148188 0.155962 0.156784 0.157029
qa: -0.1232 -0.5182 -0.1225 -0.0691 -0.0926 -0.0905 -0.0897 0.3168 -0.2836 -0.2771 -0.0649 0.0299 -0.2122 -0.1924 -0.1377 -0.1473 -0.1775 0.1021 0.1062 0.1090 0.1122 0.0720 0.0666 0.0697 0.0607 0.0806 0.0840 0.0973 0.0853 0.0975 0.0827 0.1396 0.1305 0.1380 0.1482 0.1560 0.1568 0.1570
va: 2.3147 1.9809 3.1180 3.8608 3.8801 3.8687 3.8785 4.2663 3.9286 3.9232 3.7591 3.6109 3.9830 3.9313 3.8810 3.9146 3.9111 1.0165 0.9938 1.0064 0.9917 1.0131 1.0205 1.0153 1.0255 1.0010 0.9995 1.0065 0.9990 1.0068 1.0019 1.0057 1.0338 1.0053 1.0195 0.9907 0.9921 0.9908
dispcorr: -0.017090469 hartree
energy: -1074.438301964394
dipole: -20.28005 19.15999 -1.12006 -1.21295 0.44045 -0.77250 2.94505 -3.43704 -0.49200
magnitude: 1.44684 au
magnitude: 3.67758 debye
