program: Orca
programVersion: 5.0.2
elementType: S O N C C C C C C C C C C C C C C H H H H H H H H H H H H H H H H H H H H H
charge: 0
multiplicity: 1
keywords: wb97x-d3
keywords: def2-TZVPP
keywords: def2/J RIJCOSX
keywords: DEFGRID2
keywords: scfconv7
keywords: smallprint printgap noloewdin
keywords: NOSOSCF
formula: C14H21NOS
InChI: InChI=1/C14H21NOS/c1-3-10-15(11-4-2)14(16)17-12-13-8-6-5-7-9-13/h5-9H,3-4,10-12H2,1-2H3
38 atoms
S  -0.16177 -1.191652 1.023873
O  -0.377166 1.381134 1.59132
N  -2.228495 0.432857 0.686055
C  -3.009012 1.660984 0.808204
C  -2.860554 -0.707554 0.03674
C  -3.169105 2.440292 -0.490874
C  -2.506521 -0.886312 -1.436104
C  -0.958085 0.418162 1.123626
C  -1.857653 2.889717 -1.113542
C  -3.151405 -2.139934 -2.004686
C  1.503445 -0.800076 1.641915
C  2.50154 -0.582456 0.544863
C  2.54794 0.619913 -0.159707
C  3.403588 -1.588641 0.213222
C  3.48052 0.80944 -1.168233
C  4.33727 -1.401029 -0.797864
C  4.379104 -0.200256 -1.491042
H  -2.545039 2.293024 1.563073
H  -3.993668 1.384751 1.19212
H  -3.938953 -0.572329 0.13706
H  -2.634052 -1.622717 0.591728
H  -3.743588 1.852567 -1.211446
H  -3.785476 3.313967 -0.261917
H  -2.8369 -0.012204 -2.001268
H  -1.422494 -0.9441 -1.55477
H  -2.039572 3.459815 -2.025627
H  -1.290066 3.528728 -0.435144
H  -1.221633 2.04525 -1.384861
H  -4.238718 -2.111572 -1.908699
H  -2.919825 -2.25435 -3.064022
H  -2.798094 -3.037162 -1.492712
H  1.424711 0.064085 2.300263
H  1.78828 -1.653044 2.258447
H  1.854966 1.415405 0.084976
H  3.379323 -2.528298 0.752891
H  3.508356 1.750781 -1.702367
H  5.033489 -2.193829 -1.040485
H  5.108572 -0.049464 -2.276543
elementType: S O N C H
totalener: -1074.42192356 hartree
nucrepener: 1353.54716363 hartree
electener: -2427.96908719 hartree
oneelecener: -4155.70855522 hartree
twoeener: 1727.73946803 hartree
cpcmener: -0.01904094 hartree
kineticenergy: 1070.54964104 hartree
xcener: -87.038596375556 hartree
chargesum: -0.0000000
charge: -0.119886 -0.511353 -0.111162 -0.061037 -0.097322 -0.110866 -0.079272 0.294871 -0.269114 -0.276855 -0.066184 0.033609 -0.198450 -0.211004 -0.147590 -0.137060 -0.176173 0.101206 0.101910 0.109425 0.106281 0.072306 0.077330 0.072243 0.062163 0.096376 0.087450 0.073300 0.081736 0.093163 0.084325 0.132840 0.136310 0.149103 0.138333 0.156072 0.156210 0.156764
qa: -0.1199 -0.5114 -0.1112 -0.0610 -0.0973 -0.1109 -0.0793 0.2949 -0.2691 -0.2769 -0.0662 0.0336 -0.1984 -0.2110 -0.1476 -0.1371 -0.1762 0.1012 0.1019 0.1094 0.1063 0.0723 0.0773 0.0722 0.0622 0.0964 0.0875 0.0733 0.0817 0.0932 0.0843 0.1328 0.1363 0.1491 0.1383 0.1561 0.1562 0.1568
va: 2.3191 1.9840 3.1663 3.8514 3.8719 3.8650 3.8228 4.2783 3.9300 3.9610 3.7657 3.6168 3.9318 3.9815 3.9124 3.8807 3.9097 1.0237 1.0059 0.9982 1.0046 1.0029 1.0134 1.0095 1.0311 1.0059 1.0055 1.0016 1.0013 1.0028 1.0016 1.0330 1.0074 1.0158 1.0051 0.9924 0.9908 0.9908
dispcorr: -0.017280623 hartree
energy: -1074.439204186720
dipole: -15.92904 14.77305 -1.15599 3.89132 -4.47801 -0.58668 -11.14438 10.46047 -0.68391
magnitude: 1.46568 au
magnitude: 3.72548 debye
