program: Orca
programVersion: 5.0.2
elementType: S O N C C C C C C C C C C C C C C H H H H H H H H H H H H H H H H H H H H H
charge: 0
multiplicity: 1
keywords: wb97x-d3
keywords: def2-TZVPP
keywords: def2/J RIJCOSX
keywords: DEFGRID2
keywords: scfconv7
keywords: smallprint printgap noloewdin
keywords: NOSOSCF
formula: C14H21NOS
InChI: InChI=1/C14H21NOS/c1-3-10-15(11-4-2)14(16)17-12-13-8-6-5-7-9-13/h5-9H,3-4,10-12H2,1-2H3
38 atoms
S  -0.136169 -1.297302 0.393508
O  -0.473433 0.984613 1.687725
N  -2.102059 0.467031 0.197469
C  -2.886383 1.657454 0.51177
C  -2.667217 -0.44308 -0.787832
C  -2.719654 2.779537 -0.505631
C  -3.527967 -1.545361 -0.184438
C  -0.948078 0.242433 0.846571
C  -1.294887 3.289855 -0.649291
C  -4.087158 -2.460402 -1.262345
C  1.422966 -1.162898 1.320669
C  2.554712 -0.652599 0.479824
C  2.694321 0.708213 0.211111
C  3.481835 -1.54049 -0.058092
C  3.738065 1.167132 -0.57787
C  4.527853 -1.082492 -0.848587
C  4.658558 0.273123 -1.111261
H  -2.618401 2.008302 1.506838
H  -3.935899 1.357675 0.558366
H  -1.8706 -0.868796 -1.402443
H  -3.270722 0.15637 -1.472348
H  -3.094367 2.45385 -1.480337
H  -3.37489 3.596402 -0.190974
H  -2.939092 -2.129076 0.527116
H  -4.34668 -1.094977 0.383623
H  -0.894988 3.645818 0.301314
H  -0.621861 2.518398 -1.027557
H  -1.256099 4.121917 -1.353814
H  -3.288291 -2.942562 -1.829099
H  -4.703185 -3.248781 -0.828977
H  -4.709562 -1.911278 -1.971619
H  1.244619 -0.538141 2.194655
H  1.632347 -2.171449 1.678498
H  1.985115 1.414969 0.62414
H  3.387402 -2.601223 0.14365
H  3.835586 2.227166 -0.775101
H  5.241187 -1.787007 -1.257318
H  5.47382 0.632814 -1.725974
elementType: S O N C H
totalener: -1074.42311783 hartree
nucrepener: 1342.08160321 hartree
electener: -2416.50472104 hartree
oneelecener: -4132.78276470 hartree
twoeener: 1716.27804366 hartree
cpcmener: -0.01937108 hartree
kineticenergy: 1070.54491171 hartree
xcener: -87.036916569211 hartree
chargesum: 0.0000000
charge: -0.120892 -0.511871 -0.110990 -0.061149 -0.101453 -0.094996 -0.069203 0.293587 -0.266847 -0.274043 -0.068085 0.035704 -0.196369 -0.211739 -0.149516 -0.139292 -0.175023 0.100404 0.106913 0.105540 0.111719 0.061165 0.070925 0.057277 0.068016 0.083159 0.074361 0.095830 0.083517 0.092978 0.082312 0.133071 0.136690 0.150023 0.138131 0.156170 0.156679 0.157299
qa: -0.1209 -0.5119 -0.1110 -0.0611 -0.1015 -0.0950 -0.0692 0.2936 -0.2668 -0.2740 -0.0681 0.0357 -0.1964 -0.2117 -0.1495 -0.1393 -0.1750 0.1004 0.1069 0.1055 0.1117 0.0612 0.0709 0.0573 0.0680 0.0832 0.0744 0.0958 0.0835 0.0930 0.0823 0.1331 0.1367 0.1500 0.1381 0.1562 0.1567 0.1573
va: 2.3165 1.9854 3.1594 3.8539 3.8741 3.8778 3.8321 4.2860 3.9268 3.9423 3.7575 3.6165 3.9324 3.9819 3.9118 3.8805 3.9096 1.0223 1.0019 1.0137 0.9960 1.0098 1.0135 1.0311 1.0141 1.0059 1.0038 1.0062 1.0009 1.0035 1.0016 1.0332 1.0067 1.0133 1.0053 0.9925 0.9906 0.9905
dispcorr: -0.016665859 hartree
energy: -1074.439783689815
dipole: -17.00025 15.91191 -1.08834 4.56757 -4.92699 -0.35942 -7.20062 6.23725 -0.96337
magnitude: 1.49725 au
magnitude: 3.80570 debye
