program: Orca
programVersion: 5.0.2
elementType: S O N C C C C C C C C C C C C C C H H H H H H H H H H H H H H H H H H H H H
charge: 0
multiplicity: 1
keywords: wb97x-d3
keywords: def2-TZVPP
keywords: def2/J RIJCOSX
keywords: DEFGRID2
keywords: scfconv7
keywords: smallprint printgap noloewdin
keywords: NOSOSCF
formula: C14H21NOS
InChI: InChI=1/C14H21NOS/c1-3-10-15(11-4-2)14(16)17-12-13-8-6-5-7-9-13/h5-9H,3-4,10-12H2,1-2H3
38 atoms
S  -0.193936 -0.967236 1.556863
O  -0.081087 1.588852 0.923791
N  -1.864176 0.497252 0.069494
C  -2.399244 1.733709 -0.480802
C  -2.6075 -0.718222 -0.20313
C  -3.256654 2.505615 0.513864
C  -2.373999 -1.271621 -1.607032
C  -0.717245 0.570756 0.778792
C  -3.856256 3.755813 -0.111248
C  -0.931294 -1.657081 -1.897172
C  1.547586 -0.54616 1.865166
C  2.382538 -0.674166 0.626934
C  2.77951 0.4501 -0.088448
C  2.750635 -1.932953 0.158608
C  3.529593 0.316305 -1.248787
C  3.499395 -2.067872 -0.997951
C  3.890473 -0.940351 -1.707814
H  -2.99371 1.474681 -1.360093
H  -1.579392 2.359137 -0.834205
H  -3.66988 -0.498541 -0.064515
H  -2.368573 -1.480335 0.538538
H  -4.055178 1.85774 0.886792
H  -2.644826 2.776275 1.376273
H  -3.024345 -2.142296 -1.727773
H  -2.715836 -0.542718 -2.347882
H  -4.490726 3.512323 -0.965528
H  -4.468529 4.301764 0.605828
H  -3.078495 4.436164 -0.461601
H  -0.256657 -0.804476 -1.817796
H  -0.570021 -2.417182 -1.205422
H  -0.837122 -2.052576 -2.908554
H  1.59474 0.452363 2.29516
H  1.866258 -1.25466 2.631254
H  2.49146 1.43295 0.259291
H  2.440336 -2.817427 0.703028
H  3.831249 1.200228 -1.795489
H  3.778521 -3.053446 -1.347254
H  4.475706 -1.042888 -2.61219
totalener: -1074.40272451 hartree
nucrepener: 1368.73405580 hartree
electener: -2443.13678031 hartree
oneelecener: -4185.65236492 hartree
twoeener: 1742.51558460 hartree
kineticenergy: 1070.59348573 hartree
xcener: -87.042532180435 hartree
chargesum: -0.0000000
charge: -0.120435 -0.425676 -0.134447 -0.063188 -0.109466 -0.075365 -0.080144 0.292442 -0.256162 -0.251609 -0.091931 0.047972 -0.148636 -0.200185 -0.115464 -0.104230 -0.139855 0.086316 0.099821 0.097709 0.104243 0.048088 0.077674 0.064443 0.056023 0.070053 0.087120 0.081511 0.081701 0.077632 0.089845 0.125370 0.128502 0.125874 0.104914 0.124571 0.121788 0.123181
qa: -0.1204 -0.4257 -0.1344 -0.0632 -0.1095 -0.0754 -0.0801 0.2924 -0.2562 -0.2516 -0.0919 0.0480 -0.1486 -0.2002 -0.1155 -0.1042 -0.1399 0.0863 0.0998 0.0977 0.1042 0.0481 0.0777 0.0644 0.0560 0.0701 0.0871 0.0815 0.0817 0.0776 0.0898 0.1254 0.1285 0.1259 0.1049 0.1246 0.1218 0.1232
va: 2.2945 2.0773 3.1349 3.8584 3.9477 3.8637 3.8418 4.2704 3.9477 3.9466 3.8393 3.5965 3.9661 4.0149 3.9508 3.9456 3.9695 0.9986 1.0231 1.0024 1.0077 1.0143 1.0193 1.0154 1.0094 1.0034 1.0053 1.0029 1.0050 1.0094 1.0083 1.0330 1.0031 1.0233 1.0157 1.0003 1.0000 0.9998
dispcorr: -0.018007033 hartree
energy: -1074.420731547317
dipole: -15.34249 14.61694 -0.72555 5.28948 -5.70512 -0.41564 -9.75890 9.24086 -0.51804
magnitude: 0.98364 au
magnitude: 2.50022 debye
