program: Orca
programVersion: 5.0.2
elementType: S O N C C C C C C C C C C C C C C H H H H H H H H H H H H H H H H H H H H H
charge: 0
multiplicity: 1
keywords: wb97x-d3
keywords: def2-TZVPP
keywords: def2/J RIJCOSX
keywords: DEFGRID2
keywords: scfconv7
keywords: smallprint printgap noloewdin
keywords: NOSOSCF
formula: C14H21NOS
InChI: InChI=1/C14H21NOS/c1-3-10-15(11-4-2)14(16)17-12-13-8-6-5-7-9-13/h5-9H,3-4,10-12H2,1-2H3
38 atoms
S  -0.096221 -1.109351 1.218276
O  -0.159095 1.509743 0.897558
N  -1.993101 0.429371 0.144054
C  -2.630644 1.689415 -0.207225
C  -2.750529 -0.781781 -0.106724
C  -3.366745 2.334309 0.960506
C  -2.754042 -1.207729 -1.57236
C  -0.768746 0.480849 0.713643
C  -4.086586 3.606575 0.537181
C  -1.373613 -1.504238 -2.137729
C  1.58897 -0.597927 1.673982
C  2.5371 -0.630951 0.51361
C  3.185617 -1.814309 0.173024
C  2.776925 0.50834 -0.248693
C  4.055234 -1.862656 -0.904669
C  3.646165 0.461027 -1.328332
C  4.287744 -0.722794 -1.660484
H  -3.331019 1.489196 -1.021565
H  -1.88233 2.376153 -0.603218
H  -3.777351 -0.612982 0.230982
H  -2.371582 -1.594429 0.513781
H  -4.086006 1.623376 1.377332
H  -2.65036 2.55609 1.753175
H  -3.389625 -2.093612 -1.654571
H  -3.241856 -0.437099 -2.176466
H  -3.386436 4.347359 0.147702
H  -4.825186 3.409619 -0.242046
H  -4.61053 4.062207 1.376951
H  -0.876847 -2.303741 -1.58888
H  -1.443797 -1.808259 -3.182092
H  -0.722079 -0.631454 -2.095469
H  1.531963 0.38817 2.131273
H  1.892176 -1.306509 2.44577
H  3.008231 -2.70939 0.758188
H  2.275125 1.432943 0.00283
H  4.553578 -2.790667 -1.153355
H  3.82384 1.355349 -1.911523
H  4.967429 -0.757038 -2.501899
totalener: -1074.40375453 hartree
nucrepener: 1350.54364248 hartree
electener: -2424.94739701 hartree
oneelecener: -4149.23138452 hartree
twoeener: 1724.28398752 hartree
kineticenergy: 1070.58683569 hartree
xcener: -87.041720617662 hartree
chargesum: -0.0000000
charge: -0.115210 -0.433847 -0.137783 -0.060916 -0.107272 -0.077591 -0.083158 0.296349 -0.255833 -0.256279 -0.098064 0.054332 -0.188846 -0.165472 -0.111391 -0.113093 -0.140467 0.087023 0.098744 0.097571 0.103150 0.047781 0.078520 0.065424 0.056461 0.081176 0.070107 0.087159 0.082197 0.088885 0.083336 0.129402 0.127201 0.103751 0.136810 0.122381 0.124301 0.123163
qa: -0.1152 -0.4338 -0.1378 -0.0609 -0.1073 -0.0776 -0.0832 0.2963 -0.2558 -0.2563 -0.0981 0.0543 -0.1888 -0.1655 -0.1114 -0.1131 -0.1405 0.0870 0.0987 0.0976 0.1032 0.0478 0.0785 0.0654 0.0565 0.0812 0.0701 0.0872 0.0822 0.0889 0.0833 0.1294 0.1272 0.1038 0.1368 0.1224 0.1243 0.1232
va: 2.3058 2.0642 3.1409 3.8608 3.9369 3.8615 3.8379 4.2589 3.9477 3.9474 3.8199 3.6210 4.0397 3.9751 3.9522 3.9528 3.9695 0.9981 1.0225 1.0029 1.0108 1.0144 1.0200 1.0156 1.0089 1.0029 1.0035 1.0054 1.0081 1.0072 1.0061 1.0325 1.0048 1.0134 1.0219 1.0003 1.0009 1.0001
dispcorr: -0.016956559 hartree
energy: -1074.420711084246
dipole: -17.40459 16.59115 -0.81344 5.67023 -6.05564 -0.38541 -7.33425 6.96260 -0.37165
magnitude: 0.97384 au
magnitude: 2.47530 debye
