program: Orca
programVersion: 5.0.2
elementType: S O N C C C C C C C C C C C C C C H H H H H H H H H H H H H H H H H H H H H
charge: 0
multiplicity: 1
keywords: wb97x-d3
keywords: def2-TZVPP
keywords: def2/J RIJCOSX
keywords: DEFGRID2
keywords: scfconv7
keywords: smallprint printgap noloewdin
keywords: NOSOSCF
formula: C14H21NOS
InChI: InChI=1/C14H21NOS/c1-3-10-15(11-4-2)14(16)17-12-13-8-6-5-7-9-13/h5-9H,3-4,10-12H2,1-2H3
38 atoms
S  0.03361 -0.081491 -1.703434
O  -0.068507 1.775197 0.170377
N  -1.931237 0.509974 0.002709
C  -2.604863 1.308397 1.015693
C  -2.682126 -0.590373 -0.571294
C  -3.285864 2.547293 0.447326
C  -2.725806 -1.830362 0.318087
C  -0.677593 0.868922 -0.350536
C  -4.028383 3.321316 1.526776
C  -1.365279 -2.453944 0.589477
C  1.761285 0.472902 -1.581366
C  2.543421 -0.311419 -0.571797
C  2.773171 0.192722 0.704147
C  3.038363 -1.57202 -0.895283
C  3.484488 -0.55044 1.635642
C  3.748231 -2.314855 0.033417
C  3.972129 -1.805196 1.305145
H  -1.889074 1.595375 1.786096
H  -3.34589 0.668695 1.501084
H  -2.279186 -0.849341 -1.550817
H  -3.700201 -0.237465 -0.760129
H  -2.532615 3.18501 -0.018235
H  -3.981199 2.252716 -0.343862
H  -3.213055 -1.58224 1.265457
H  -3.379219 -2.559873 -0.168217
H  -4.514659 4.205567 1.116279
H  -4.801375 2.711651 1.997726
H  -3.349095 3.656283 2.311831
H  -1.468471 -3.338003 1.218932
H  -0.869325 -2.755462 -0.332416
H  -0.696628 -1.763752 1.103662
H  2.164095 0.33137 -2.58522
H  1.766279 1.540318 -1.368446
H  2.385594 1.167168 0.969062
H  2.862851 -1.977241 -1.885268
H  3.656779 -0.145892 2.624604
H  4.128678 -3.291844 -0.234889
H  4.527234 -2.382939 2.032545
totalener: -1074.40331265 hartree
nucrepener: 1356.53695108 hartree
electener: -2430.94026373 hartree
oneelecener: -4161.24007305 hartree
twoeener: 1730.29980932 hartree
kineticenergy: 1070.58635933 hartree
xcener: -87.041225200415 hartree
chargesum: -0.0000000
charge: -0.117477 -0.430887 -0.136011 -0.062028 -0.107960 -0.076539 -0.083081 0.294614 -0.255983 -0.253756 -0.096799 0.051553 -0.155018 -0.192282 -0.115669 -0.109580 -0.139754 0.098657 0.086977 0.103613 0.097723 0.078326 0.047988 0.055981 0.065211 0.086726 0.070534 0.081446 0.088783 0.080070 0.083733 0.129347 0.127194 0.130180 0.104112 0.124657 0.122202 0.123194
qa: -0.1175 -0.4309 -0.1360 -0.0620 -0.1080 -0.0765 -0.0831 0.2946 -0.2560 -0.2538 -0.0968 0.0516 -0.1550 -0.1923 -0.1157 -0.1096 -0.1398 0.0987 0.0870 0.1036 0.0977 0.0783 0.0480 0.0560 0.0652 0.0867 0.0705 0.0814 0.0888 0.0801 0.0837 0.1293 0.1272 0.1302 0.1041 0.1247 0.1222 0.1232
va: 2.3012 2.0698 3.1371 3.8614 3.9408 3.8621 3.8417 4.2647 3.9473 3.9462 3.8279 3.6078 3.9718 4.0318 3.9538 3.9536 3.9688 1.0225 0.9981 1.0092 1.0026 1.0197 1.0143 1.0097 1.0150 1.0056 1.0033 1.0030 1.0075 1.0082 1.0059 1.0036 1.0331 1.0227 1.0146 1.0005 1.0002 1.0000
dispcorr: -0.017241502 hartree
energy: -1074.420554153731
dipole: -17.52968 16.71866 -0.81101 0.37767 -0.91182 -0.53415 8.17889 -8.14301 0.03589
magnitude: 0.97178 au
magnitude: 2.47006 debye
