program: Orca
programVersion: 5.0.2
elementType: S O N C C C C C C C C C C C C C C H H H H H H H H H H H H H H H H H H H H H
charge: 0
multiplicity: 1
keywords: wb97x-d3
keywords: def2-TZVPP
keywords: def2/J RIJCOSX
keywords: DEFGRID2
keywords: scfconv7
keywords: smallprint printgap noloewdin
keywords: NOSOSCF
formula: C14H21NOS
InChI: InChI=1/C14H21NOS/c1-3-10-15(11-4-2)14(16)17-12-13-8-6-5-7-9-13/h5-9H,3-4,10-12H2,1-2H3
38 atoms
S  -0.13656 -0.866943 1.485593
O  -0.118451 1.678641 0.786486
N  -1.921705 0.523013 0.069981
C  -2.5249 1.731844 -0.471135
C  -2.665201 -0.711165 -0.100287
C  -3.352178 2.493339 0.556882
C  -2.530628 -1.316792 -1.494985
C  -0.736487 0.64115 0.707441
C  -4.017145 3.719585 -0.049901
C  -1.109771 -1.702335 -1.876511
C  1.587002 -0.375976 1.796533
C  2.465399 -0.625866 0.608355
C  2.722886 0.382466 -0.315418
C  3.016836 -1.88625 0.397251
C  3.512304 0.131077 -1.42792
C  3.806925 -2.138031 -0.712595
C  4.056039 -1.128264 -1.630997
H  -3.156503 1.438343 -1.313094
H  -1.745142 2.375891 -0.877442
H  -3.717613 -0.498654 0.108436
H  -2.361733 -1.440149 0.651239
H  -4.113009 1.829565 0.977692
H  -2.704807 2.791074 1.383693
H  -3.178482 -2.196772 -1.533417
H  -2.934499 -0.620009 -2.235473
H  -4.609271 4.255363 0.691388
H  -3.27693 4.417594 -0.443678
H  -4.685293 3.449849 -0.869831
H  -0.439817 -0.84244 -1.875196
H  -0.691925 -2.435904 -1.187999
H  -1.085987 -2.131656 -2.878159
H  1.594702 0.667641 2.105942
H  1.897371 -0.980288 2.64978
H  2.296359 1.365235 -0.164965
H  2.823448 -2.681057 1.108418
H  3.704209 0.924953 -2.137963
H  4.230252 -3.123052 -0.859925
H  4.67359 -1.3220 -2.498164
totalener: -1074.40332854 hartree
nucrepener: 1359.01986416 hartree
electener: -2433.42319270 hartree
oneelecener: -4166.18392264 hartree
twoeener: 1732.76072994 hartree
kineticenergy: 1070.58978112 hartree
xcener: -87.042051168358 hartree
chargesum: -0.0000000
charge: -0.115701 -0.429981 -0.134293 -0.061607 -0.107459 -0.076806 -0.081718 0.289187 -0.256237 -0.250745 -0.098835 0.053143 -0.167561 -0.189530 -0.112230 -0.108341 -0.140564 0.087306 0.099177 0.097211 0.103571 0.048066 0.077452 0.064775 0.055486 0.087217 0.081740 0.070220 0.080307 0.080750 0.088927 0.130909 0.126674 0.136106 0.103376 0.124605 0.122546 0.122862
qa: -0.1157 -0.4300 -0.1343 -0.0616 -0.1075 -0.0768 -0.0817 0.2892 -0.2562 -0.2507 -0.0988 0.0531 -0.1676 -0.1895 -0.1122 -0.1083 -0.1406 0.0873 0.0992 0.0972 0.1036 0.0481 0.0775 0.0648 0.0555 0.0872 0.0817 0.0702 0.0803 0.0808 0.0889 0.1309 0.1267 0.1361 0.1034 0.1246 0.1225 0.1229
va: 2.2987 2.0703 3.1379 3.8580 3.9439 3.8642 3.8422 4.2679 3.9479 3.9475 3.8263 3.6108 3.9657 4.0318 3.9520 3.9503 3.9702 0.9983 1.0238 1.0026 1.0085 1.0145 1.0189 1.0153 1.0093 1.0053 1.0029 1.0034 1.0062 1.0083 1.0079 1.0317 1.0048 1.0216 1.0138 1.0005 1.0001 1.0002
dispcorr: -0.017457473 hartree
energy: -1074.420786009943
dipole: -16.40935 15.64206 -0.76729 4.79649 -5.24563 -0.44915 -8.95206 8.52845 -0.42362
magnitude: 0.98484 au
magnitude: 2.50327 debye
