program: Orca
programVersion: 5.0.2
elementType: S O N C C C C C C C C C C C C C C H H H H H H H H H H H H H H H H H H H H H
charge: 0
multiplicity: 1
keywords: wb97x-d3
keywords: def2-TZVPP
keywords: def2/J RIJCOSX
keywords: DEFGRID2
keywords: scfconv7
keywords: smallprint printgap noloewdin
keywords: NOSOSCF
formula: C14H21NOS
InChI: InChI=1/C14H21NOS/c1-3-10-15(11-4-2)14(16)17-12-13-8-6-5-7-9-13/h5-9H,3-4,10-12H2,1-2H3
38 atoms
S  0.00831 -0.412517 -1.649683
O  -0.093301 1.756523 -0.149341
N  -1.943567 0.465821 -0.0544
C  -2.603441 1.427968 0.81503
C  -2.69979 -0.715439 -0.424783
C  -3.278413 2.561942 0.053276
C  -2.76003 -1.774547 0.673059
C  -0.698854 0.764536 -0.486528
C  -3.992749 3.52229 0.992552
C  -1.400033 -2.303237 1.101907
C  1.725451 0.186974 -1.677204
C  2.549646 -0.383706 -0.56282
C  3.107038 -1.65363 -0.684102
C  2.760379 0.331528 0.611561
C  3.856911 -2.200805 0.344091
C  3.511256 -0.215506 1.642103
C  4.060974 -1.481639 1.5131
H  -1.878803 1.832922 1.521725
H  -3.344624 0.885104 1.406669
H  -2.288772 -1.152201 -1.335359
H  -3.713594 -0.398178 -0.686292
H  -2.525764 3.099161 -0.526224
H  -3.991065 2.147214 -0.665596
H  -3.29087 -1.373301 1.541311
H  -3.380478 -2.594562 0.301552
H  -4.463936 4.336111 0.442516
H  -4.773683 3.018771 1.565193
H  -3.297763 3.968556 1.705344
H  -1.509793 -3.066036 1.87261
H  -0.858004 -2.745654 0.266798
H  -0.770427 -1.513229 1.511076
H  2.108746 -0.128024 -2.648705
H  1.708876 1.275207 -1.662638
H  2.949279 -2.222575 -1.593165
H  2.326872 1.31638 0.721226
H  4.285605 -3.188168 0.231959
H  3.667439 0.352675 2.549911
H  4.647635 -1.905689 2.317501
totalener: -1074.40362779 hartree
nucrepener: 1355.06875302 hartree
electener: -2429.47238081 hartree
oneelecener: -4158.29914112 hartree
twoeener: 1728.82676031 hartree
kineticenergy: 1070.58615038 hartree
xcener: -87.041530363459 hartree
chargesum: 0.0000000
charge: -0.117658 -0.432625 -0.135903 -0.061527 -0.109444 -0.077065 -0.081999 0.296537 -0.255897 -0.254952 -0.096252 0.053197 -0.192251 -0.158358 -0.108911 -0.115050 -0.140985 0.098016 0.088064 0.103487 0.097144 0.078684 0.047500 0.055864 0.065623 0.086848 0.070541 0.081223 0.088853 0.081474 0.083154 0.128494 0.128485 0.103417 0.132722 0.122304 0.123872 0.123372
qa: -0.1177 -0.4326 -0.1359 -0.0615 -0.1094 -0.0771 -0.0820 0.2965 -0.2559 -0.2550 -0.0963 0.0532 -0.1923 -0.1584 -0.1089 -0.1150 -0.1410 0.0980 0.0881 0.1035 0.0971 0.0787 0.0475 0.0559 0.0656 0.0868 0.0705 0.0812 0.0889 0.0815 0.0832 0.1285 0.1285 0.1034 0.1327 0.1223 0.1239 0.1234
va: 2.3027 2.0668 3.1383 3.8605 3.9422 3.8624 3.8370 4.2613 3.9481 3.9470 3.8242 3.6112 4.0358 3.9723 3.9519 3.9524 3.9692 1.0219 0.9981 1.0094 1.0028 1.0204 1.0139 1.0093 1.0156 1.0056 1.0033 1.0029 1.0075 1.0089 1.0061 1.0040 1.0325 1.0141 1.0228 1.0001 1.0007 0.9999
dispcorr: -0.017152769 hartree
energy: -1074.420780563339
dipole: -17.48105 16.67061 -0.81044 1.85366 -2.37117 -0.51751 8.34837 -8.21352 0.13485
magnitude: 0.97098 au
magnitude: 2.46804 debye
