program: Orca
programVersion: 5.0.2
elementType: S O N C C C C C C C C C C C C C C H H H H H H H H H H H H H H H H H H H H H
charge: 0
multiplicity: 1
keywords: wb97x-d3
keywords: def2-TZVPP
keywords: def2/J RIJCOSX
keywords: DEFGRID2
keywords: scfconv7
keywords: smallprint printgap noloewdin
keywords: NOSOSCF
formula: C14H21NOS
InChI: InChI=1/C14H21NOS/c1-3-10-15(11-4-2)14(16)17-12-13-8-6-5-7-9-13/h5-9H,3-4,10-12H2,1-2H3
38 atoms
S  -0.133342 -1.55801 0.590952
O  -0.454807 -0.442393 -1.777019
N  -1.97938 0.181499 -0.217707
C  -2.624832 1.113256 -1.134049
C  -2.475963 0.120639 1.146781
C  -2.205602 2.564289 -0.916569
C  -3.35741 -1.08887 1.445147
C  -0.896669 -0.503032 -0.652423
C  -0.716766 2.821667 -1.093482
C  -4.598705 -1.176952 0.57097
C  1.458834 -1.879343 -0.230229
C  2.454082 -0.783358 0.004244
C  2.608285 0.253266 -0.911696
C  3.229014 -0.776299 1.160733
C  3.512524 1.277054 -0.669234
C  4.134476 0.244362 1.402509
C  4.276748 1.2779 0.48781
H  -3.705713 1.020877 -1.008648
H  -2.396732 0.807111 -2.153192
H  -3.049022 1.034408 1.31837
H  -1.638875 0.157361 1.847951
H  -2.77443 3.174817 -1.623345
H  -2.519105 2.896006 0.078265
H  -2.772599 -2.005773 1.345688
H  -3.648493 -1.030256 2.497328
H  -0.494182 3.882551 -0.978176
H  -0.121132 2.28424 -0.355463
H  -0.372522 2.511681 -2.079787
H  -4.338676 -1.293441 -0.481448
H  -5.209949 -2.035413 0.848298
H  -5.223287 -0.286686 0.667361
H  1.803408 -2.82083 0.199192
H  1.267282 -2.04575 -1.28871
H  2.011385 0.26179 -1.813466
H  3.120799 -1.577828 1.88232
H  3.620606 2.076602 -1.390521
H  4.730004 0.233053 2.306015
H  4.982566 2.076474 0.674762
totalener: -1074.40261294 hartree
nucrepener: 1371.32579888 hartree
electener: -2445.72841182 hartree
oneelecener: -4190.79423876 hartree
twoeener: 1745.06582694 hartree
kineticenergy: 1070.58674839 hartree
xcener: -87.042551629922 hartree
chargesum: -0.0000000
charge: -0.110277 -0.423801 -0.132085 -0.079361 -0.120460 -0.103684 -0.087269 0.289286 -0.237979 -0.263989 -0.104351 0.067560 -0.184370 -0.188558 -0.104726 -0.111849 -0.140010 0.099210 0.108612 0.095241 0.115497 0.065773 0.050485 0.069180 0.064676 0.088168 0.071640 0.087575 0.082522 0.094163 0.076106 0.125708 0.131161 0.138079 0.103528 0.123220 0.122252 0.123126
qa: -0.1103 -0.4238 -0.1321 -0.0794 -0.1205 -0.1037 -0.0873 0.2893 -0.2380 -0.2640 -0.1044 0.0676 -0.1844 -0.1886 -0.1047 -0.1118 -0.1400 0.0992 0.1086 0.0952 0.1155 0.0658 0.0505 0.0692 0.0647 0.0882 0.0716 0.0876 0.0825 0.0942 0.0761 0.1257 0.1312 0.1381 0.1035 0.1232 0.1223 0.1231
va: 2.3100 2.0746 3.0779 3.8533 3.8834 3.9034 3.8487 4.2841 3.9297 3.9214 3.8279 3.6070 3.9623 4.0447 3.9316 3.9509 3.9711 0.9976 1.0249 0.9987 1.0221 1.0144 1.0111 1.0267 1.0170 1.0068 1.0064 1.0073 1.0037 1.0096 0.9997 1.0046 1.0311 1.0193 1.0133 1.0011 1.0003 0.9998
dispcorr: -0.018109828 hartree
energy: -1074.420722768837
dipole: -15.82492 15.19346 -0.63147 9.05666 -8.67613 0.38052 0.78627 -0.12534 0.66094
magnitude: 0.99015 au
magnitude: 2.51675 debye
