program: Orca
programVersion: 5.0.2
elementType: S O N C C C C C C C C C C C C C C H H H H H H H H H H H H H H H H H H H H H
charge: 0
multiplicity: 1
keywords: wb97x-d3
keywords: def2-TZVPP
keywords: def2/J RIJCOSX
keywords: DEFGRID2
keywords: scfconv7
keywords: smallprint printgap noloewdin
keywords: NOSOSCF
formula: C14H21NOS
InChI: InChI=1/C14H21NOS/c1-3-10-15(11-4-2)14(16)17-12-13-8-6-5-7-9-13/h5-9H,3-4,10-12H2,1-2H3
38 atoms
S  -0.332756 -1.57474 1.387924
O  -0.285349 1.020557 1.79694
N  -2.067856 0.310102 0.59608
C  -2.602639 1.664368 0.51566
C  -2.854247 -0.764406 0.017427
C  -2.173417 2.47294 -0.707493
C  -2.773322 -0.882531 -1.502348
C  -0.912952 0.128638 1.277297
C  -0.678762 2.728138 -0.8333
C  -1.369755 -1.111563 -2.040898
C  1.420434 -1.23007 1.722305
C  2.125486 -0.686564 0.51557
C  2.550124 0.635572 0.473459
C  2.343043 -1.497313 -0.596195
C  3.181295 1.137682 -0.656652
C  2.972059 -0.998561 -1.72381
C  3.39336 0.324386 -1.757795
H  -2.323178 2.200989 1.42226
H  -3.692242 1.580171 0.521589
H  -3.89553 -0.607272 0.313127
H  -2.5661 -1.714489 0.467588
H  -2.540842 1.994713 -1.618162
H  -2.698557 3.430863 -0.645363
H  -3.420653 -1.715122 -1.791765
H  -3.211545 0.004292 -1.965677
H  -0.281706 3.229409 0.048126
H  -0.110802 1.807503 -0.965269
H  -0.477678 3.358817 -1.699755
H  -1.382314 -1.182612 -3.128518
H  -0.692517 -0.300586 -1.773873
H  -0.936109 -2.031073 -1.649304
H  1.498197 -0.562617 2.578221
H  1.82997 -2.198064 2.016513
H  2.372899 1.280488 1.3232
H  2.004142 -2.526644 -0.581939
H  3.502511 2.170767 -0.675142
H  3.133346 -1.641965 -2.578875
H  3.883468 0.716607 -2.639209
totalener: -1074.39924436 hartree
nucrepener: 1417.77857630 hartree
electener: -2492.17782066 hartree
oneelecener: -4283.81795359 hartree
twoeener: 1791.64013293 hartree
kineticenergy: 1070.59864218 hartree
xcener: -87.045791313564 hartree
chargesum: -0.0000000
charge: -0.123541 -0.411811 -0.120595 -0.067546 -0.116437 -0.125228 -0.085813 0.282588 -0.207591 -0.254258 -0.085558 0.072054 -0.161261 -0.219118 -0.111117 -0.100119 -0.134504 0.105156 0.084903 0.093212 0.102803 0.061618 0.069066 0.070305 0.068188 0.090738 0.045401 0.086623 0.091292 0.079334 0.078537 0.121337 0.128964 0.118334 0.105286 0.123490 0.122119 0.123146
qa: -0.1235 -0.4118 -0.1206 -0.0675 -0.1164 -0.1252 -0.0858 0.2826 -0.2076 -0.2543 -0.0856 0.0721 -0.1613 -0.2191 -0.1111 -0.1001 -0.1345 0.1052 0.0849 0.0932 0.1028 0.0616 0.0691 0.0703 0.0682 0.0907 0.0454 0.0866 0.0913 0.0793 0.0785 0.1213 0.1290 0.1183 0.1053 0.1235 0.1221 0.1231
va: 2.2978 2.0923 3.1085 3.8722 3.9586 3.9142 3.8158 4.2805 3.9385 3.9547 3.8584 3.5535 3.9543 4.0124 3.9204 3.9346 3.9637 1.0201 1.0047 1.0078 1.0095 1.0051 1.0135 1.0155 1.0068 1.0094 1.0015 1.0073 1.0090 0.9963 1.0099 1.0321 1.0026 1.0244 1.0185 1.0006 1.0000 0.9993
dispcorr: -0.021082472 hartree
energy: -1074.420326831003
dipole: -9.48792 8.82087 -0.66705 6.85801 -7.05164 -0.19363 -12.60736 11.93693 -0.67042
magnitude: 0.96536 au
magnitude: 2.45374 debye
