program: Orca
programVersion: 5.0.2
elementType: S O N C C C C C C C C C C C C C C H H H H H H H H H H H H H H H H H H H H H
charge: 0
multiplicity: 1
keywords: wb97x-d3
keywords: def2-TZVPP
keywords: def2/J RIJCOSX
keywords: DEFGRID2
keywords: scfconv7
keywords: smallprint printgap noloewdin
keywords: NOSOSCF
formula: C14H21NOS
InChI: InChI=1/C14H21NOS/c1-3-10-15(11-4-2)14(16)17-12-13-8-6-5-7-9-13/h5-9H,3-4,10-12H2,1-2H3
38 atoms
S  -0.145572 -1.535521 0.146931
O  -0.352411 0.694478 1.537464
N  -1.896695 0.469354 -0.095611
C  -2.496182 1.749542 0.264948
C  -2.499043 -0.271197 -1.189155
C  -1.708318 2.964199 -0.214472
C  -3.801113 -0.977583 -0.821411
C  -0.827226 0.060464 0.623092
C  -1.481315 3.000568 -1.718225
C  -3.661887 -2.01891 0.277429
C  1.377789 -1.515589 1.138888
C  2.49716 -0.763991 0.485098
C  3.19432 -1.334124 -0.57673
C  2.860084 0.504874 0.92203
C  4.236136 -0.655762 -1.186192
C  3.905278 1.18565 0.31322
C  4.595869 0.608863 -0.740831
H  -2.625036 1.798507 1.346964
H  -3.497585 1.766662 -0.170439
H  -1.779616 -0.992313 -1.579782
H  -2.685793 0.427628 -2.008036
H  -2.262776 3.854089 0.096436
H  -0.752165 3.001114 0.308235
H  -4.551043 -0.235405 -0.532253
H  -4.185039 -1.446136 -1.731586
H  -0.955683 3.909407 -2.010483
H  -0.874349 2.158674 -2.052915
H  -2.4235 2.977515 -2.270197
H  -3.304671 -1.577392 1.207773
H  -4.623242 -2.487833 0.487259
H  -2.961356 -2.806223 -0.000689
H  1.140844 -1.121417 2.125347
H  1.633372 -2.569893 1.256069
H  2.916255 -2.320007 -0.931242
H  2.316591 0.963254 1.737266
H  4.770484 -1.114607 -2.007851
H  4.17897 2.171628 0.665652
H  5.411714 1.140087 -1.213174
totalener: -1074.40266755 hartree
nucrepener: 1362.71892176 hartree
electener: -2437.12158932 hartree
oneelecener: -4173.62150894 hartree
twoeener: 1736.49991962 hartree
kineticenergy: 1070.58899757 hartree
xcener: -87.042879588544 hartree
chargesum: 0.0000000
charge: -0.114486 -0.429118 -0.136455 -0.075918 -0.121726 -0.085109 -0.073552 0.302080 -0.275899 -0.267266 -0.099912 0.048363 -0.184861 -0.140690 -0.117487 -0.118785 -0.136226 0.103524 0.089107 0.104535 0.103631 0.064680 0.081841 0.053630 0.066369 0.092952 0.084108 0.071591 0.086430 0.090336 0.082926 0.125191 0.130975 0.104361 0.123246 0.121768 0.123200 0.122646
qa: -0.1145 -0.4291 -0.1365 -0.0759 -0.1217 -0.0851 -0.0736 0.3021 -0.2759 -0.2673 -0.0999 0.0484 -0.1849 -0.1407 -0.1175 -0.1188 -0.1362 0.1035 0.0891 0.1045 0.1036 0.0647 0.0818 0.0536 0.0664 0.0930 0.0841 0.0716 0.0864 0.0903 0.0829 0.1252 0.1310 0.1044 0.1232 0.1218 0.1232 0.1226
va: 2.3127 2.0735 3.0904 3.8966 3.9027 3.8309 3.8347 4.2692 3.9363 3.9443 3.8287 3.6054 4.0402 3.9687 3.9595 3.9499 3.9644 1.0174 0.9977 1.0231 1.0005 1.0138 1.0225 1.0117 1.0156 1.0100 1.0010 0.9993 1.0040 1.0075 1.0050 1.0338 1.0017 1.0151 1.0243 1.0007 1.0009 1.0002
dispcorr: -0.017442093 hartree
energy: -1074.420109647877
dipole: -15.93447 15.25839 -0.67609 6.58307 -6.58408 -0.00101 -6.14695 5.47675 -0.67020
magnitude: 0.95198 au
magnitude: 2.41973 debye
