program: Orca
programVersion: 5.0.2
elementType: S O N C C C C C C C C C C C C C C H H H H H H H H H H H H H H H H H H H H H
charge: 0
multiplicity: 1
keywords: wb97x-d3
keywords: def2-TZVPP
keywords: def2/J RIJCOSX
keywords: DEFGRID2
keywords: scfconv7
keywords: smallprint printgap noloewdin
keywords: NOSOSCF
formula: C14H21NOS
InChI: InChI=1/C14H21NOS/c1-3-10-15(11-4-2)14(16)17-12-13-8-6-5-7-9-13/h5-9H,3-4,10-12H2,1-2H3
38 atoms
S  0.153652 0.541735 1.59789
O  -0.010886 1.560494 -0.825912
N  -1.843837 0.41007 -0.181573
C  -2.585513 -0.366589 0.793968
C  -2.49059 0.684726 -1.460131
C  -3.674619 0.42274 1.514731
C  -1.945274 -0.137946 -2.623334
C  -0.600242 0.905348 0.002381
C  -3.161231 1.611991 2.310882
C  -1.997034 -1.641319 -2.397031
C  1.879819 0.939957 1.186974
C  2.54145 -0.131283 0.373222
C  2.893077 -1.34271 0.963499
C  2.80206 0.056069 -0.979343
C  3.490711 -2.346207 0.22019
C  3.401991 -0.948743 -1.725896
C  3.745612 -2.151975 -1.13086
H  -1.891555 -0.796987 1.517309
H  -3.035377 -1.217355 0.276279
H  -2.408668 1.748049 -1.690225
H  -3.554036 0.473691 -1.329731
H  -4.422395 0.758943 0.790383
H  -4.196571 -0.272088 2.178172
H  -2.533198 0.123426 -3.507752
H  -0.921214 0.170606 -2.833834
H  -2.449736 1.304998 3.077639
H  -2.659606 2.339182 1.672295
H  -3.983104 2.127457 2.807584
H  -3.013493 -1.987452 -2.197205
H  -1.638397 -2.178347 -3.274957
H  -1.367105 -1.941539 -1.55905
H  1.907431 1.908601 0.691431
H  2.364299 1.050474 2.158682
H  2.688567 -1.503646 2.015704
H  2.523111 0.987919 -1.451983
H  3.758126 -3.281716 0.694039
H  3.597561 -0.7894 -2.778307
H  4.210657 -2.935483 -1.714662
totalener: -1074.40207124 hartree
nucrepener: 1374.25514875 hartree
electener: -2448.65721998 hartree
oneelecener: -4196.71794114 hartree
twoeener: 1748.06072115 hartree
kineticenergy: 1070.58888818 hartree
xcener: -87.042521904136 hartree
chargesum: 0.0000000
charge: -0.115832 -0.425370 -0.135219 -0.121179 -0.079149 -0.070326 -0.084683 0.300505 -0.270789 -0.274663 -0.094708 0.042582 -0.182739 -0.139774 -0.117995 -0.119542 -0.136689 0.105218 0.100652 0.104331 0.088671 0.052754 0.066716 0.064651 0.082356 0.083724 0.088583 0.090322 0.070918 0.092645 0.085051 0.123120 0.130144 0.104501 0.122520 0.122462 0.123153 0.123074
qa: -0.1158 -0.4254 -0.1352 -0.1212 -0.0791 -0.0703 -0.0847 0.3005 -0.2708 -0.2747 -0.0947 0.0426 -0.1827 -0.1398 -0.1180 -0.1195 -0.1367 0.1052 0.1007 0.1043 0.0887 0.0528 0.0667 0.0647 0.0824 0.0837 0.0886 0.0903 0.0709 0.0926 0.0851 0.1231 0.1301 0.1045 0.1225 0.1225 0.1232 0.1231
va: 2.3091 2.0801 3.0839 3.9001 3.9012 3.8322 3.8273 4.2724 3.9428 3.9364 3.8395 3.6002 4.0349 3.9645 3.9598 3.9508 3.9649 1.0261 1.0011 1.0157 0.9972 1.0120 1.0158 1.0137 1.0235 1.0043 1.0035 1.0076 1.0001 1.0101 1.0017 1.0329 1.0017 1.0166 1.0241 1.0004 1.0008 0.9999
dispcorr: -0.017875423 hartree
energy: -1074.419946658543
dipole: -17.03778 16.24400 -0.79377 -2.93353 2.41769 -0.51584 -3.89234 4.05186 0.15952
magnitude: 0.96001 au
magnitude: 2.44015 debye
