program: Orca
programVersion: 5.0.2
elementType: S O N C C C C C C C C C C C C C C H H H H H H H H H H H H H H H H H H H H H
charge: 0
multiplicity: 1
keywords: wb97x-d3
keywords: def2-TZVPP
keywords: def2/J RIJCOSX
keywords: DEFGRID2
keywords: scfconv7
keywords: smallprint printgap noloewdin
keywords: NOSOSCF
formula: C14H21NOS
InChI: InChI=1/C14H21NOS/c1-3-10-15(11-4-2)14(16)17-12-13-8-6-5-7-9-13/h5-9H,3-4,10-12H2,1-2H3
38 atoms
S  0.255138 0.963051 0.736277
O  -0.561213 -1.508422 0.259205
N  -1.864808 0.113372 -0.626752
C  -2.178098 1.520781 -0.78498
C  -2.787458 -0.881431 -1.153714
C  -3.002668 2.125681 0.347547
C  -3.817216 -1.390633 -0.150183
C  -0.79867 -0.336153 0.074258
C  -3.207025 3.619896 0.149579
C  -4.713382 -2.453046 -0.770132
C  1.556047 -0.044044 1.513706
C  2.741312 -0.27595 0.627003
C  2.780138 -1.356533 -0.249564
C  3.827589 0.591693 0.671031
C  3.887362 -1.56458 -1.057258
C  4.934692 0.385749 -0.137351
C  4.967663 -0.695685 -1.004386
H  -2.713668 1.632301 -1.730736
H  -1.251405 2.087096 -0.911125
H  -2.21126 -1.723031 -1.540415
H  -3.296845 -0.430979 -2.009061
H  -3.971007 1.623491 0.406941
H  -2.497592 1.942479 1.29832
H  -3.298995 -1.802213 0.71747
H  -4.426127 -0.558857 0.212288
H  -3.814429 4.044736 0.947933
H  -2.254264 4.151641 0.143998
H  -3.71048 3.835969 -0.794403
H  -5.474903 -2.788489 -0.066722
H  -5.230022 -2.076461 -1.655245
H  -4.137794 -3.328741 -1.073266
H  1.843489 0.511407 2.406964
H  1.099747 -0.979045 1.835653
H  1.938076 -2.034629 -0.296158
H  3.808877 1.4375 1.348535
H  3.90795 -2.411957 -1.730201
H  5.772782 1.068552 -0.08718
H  5.832089 -0.862792 -1.633476
totalener: -1074.40403119 hartree
nucrepener: 1322.37725802 hartree
electener: -2396.78128921 hartree
oneelecener: -4092.80209413 hartree
twoeener: 1696.02080491 hartree
kineticenergy: 1070.58053431 hartree
xcener: -87.039082178195 hartree
chargesum: -0.0000000
charge: -0.110056 -0.436776 -0.135956 -0.114561 -0.049816 -0.077264 -0.091012 0.300548 -0.257689 -0.257721 -0.104327 0.053538 -0.161777 -0.188342 -0.115187 -0.111044 -0.139783 0.089853 0.103617 0.098767 0.080381 0.065021 0.067072 0.080295 0.055475 0.088623 0.083462 0.072850 0.086605 0.069315 0.085067 0.124933 0.131992 0.140917 0.103350 0.124291 0.122096 0.123241
qa: -0.1101 -0.4368 -0.1360 -0.1146 -0.0498 -0.0773 -0.0910 0.3005 -0.2577 -0.2577 -0.1043 0.0535 -0.1618 -0.1883 -0.1152 -0.1110 -0.1398 0.0899 0.1036 0.0988 0.0804 0.0650 0.0671 0.0803 0.0555 0.0886 0.0835 0.0729 0.0866 0.0693 0.0851 0.1249 0.1320 0.1409 0.1033 0.1243 0.1221 0.1232
va: 2.3142 2.0587 3.1895 3.9156 3.8618 3.8141 3.8507 4.2560 3.9565 3.9567 3.8196 3.6458 3.9809 4.0442 3.9545 3.9508 3.9699 1.0051 1.0132 1.0188 1.0052 1.0142 1.0320 1.0205 1.0130 1.0053 1.0044 1.0031 1.0052 1.0028 1.0034 1.0052 1.0317 1.0197 1.0128 1.0014 1.0006 1.0002
dispcorr: -0.015818512 hartree
energy: -1074.419849703804
dipole: -22.55464 21.86597 -0.68867 2.87559 -2.23579 0.63980 -3.31370 3.06616 -0.24754
magnitude: 0.97205 au
magnitude: 2.47075 debye
