program: Orca
programVersion: 5.0.2
elementType: S O N C C C C C C C C C C C C C C H H H H H H H H H H H H H H H H H H H H H
charge: 0
multiplicity: 1
keywords: wb97x-d3
keywords: def2-TZVPP
keywords: def2/J RIJCOSX
keywords: DEFGRID2
keywords: scfconv7
keywords: smallprint printgap noloewdin
keywords: NOSOSCF
formula: C14H21NOS
InChI: InChI=1/C14H21NOS/c1-3-10-15(11-4-2)14(16)17-12-13-8-6-5-7-9-13/h5-9H,3-4,10-12H2,1-2H3
38 atoms
S  -0.038226 -1.153487 -0.6833
O  -0.093111 1.489467 -0.631898
N  -1.762069 0.480729 0.513623
C  -2.346071 1.771506 0.848416
C  -2.447259 -0.730258 0.923093
C  -3.211719 2.380317 -0.249124
C  -3.451716 -1.27233 -0.08915
C  -0.645581 0.482906 -0.249988
C  -3.766212 3.733876 0.170761
C  -4.078812 -2.571706 0.391782
C  1.514375 -0.699975 -1.515746
C  2.674716 -0.579322 -0.57516
C  3.400422 -1.709076 -0.209163
C  3.044527 0.654879 -0.049777
C  4.471841 -1.611768 0.663983
C  4.117074 0.753686 0.823821
C  4.833634 -0.377534 1.184098
H  -1.543754 2.465107 1.104951
H  -2.941333 1.632027 1.75404
H  -2.956099 -0.514144 1.8655
H  -1.709202 -1.500556 1.163125
H  -2.614589 2.489095 -1.156098
H  -4.034307 1.703229 -0.492253
H  -4.231608 -0.52837 -0.267954
H  -2.94972 -1.432593 -1.045783
H  -2.962946 4.440769 0.38536
H  -4.383539 4.16909 -0.614759
H  -4.384289 3.654721 1.067431
H  -4.610272 -2.435859 1.335468
H  -4.794318 -2.957044 -0.333682
H  -3.322518 -3.342678 0.547345
H  1.67994 -1.499911 -2.238554
H  1.341288 0.219642 -2.072332
H  3.12388 -2.677019 -0.611075
H  2.483537 1.538823 -0.321322
H  5.027346 -2.49984 0.935759
H  4.394538 1.720713 1.222709
H  5.671465 -0.298315 1.864353
totalener: -1074.40405975 hartree
nucrepener: 1327.27713169 hartree
electener: -2401.68119145 hartree
oneelecener: -4102.63940134 hartree
twoeener: 1700.95820990 hartree
kineticenergy: 1070.58368714 hartree
xcener: -87.039629945902 hartree
chargesum: 0.0000000
charge: -0.111820 -0.436759 -0.135716 -0.048150 -0.114764 -0.090620 -0.076155 0.303553 -0.256382 -0.256909 -0.103024 0.055183 -0.189434 -0.155368 -0.112018 -0.115422 -0.140416 0.098492 0.079939 0.088928 0.103299 0.080827 0.053936 0.064291 0.067274 0.082964 0.086976 0.069723 0.073015 0.088219 0.082657 0.127882 0.128366 0.103722 0.134715 0.122244 0.123812 0.122943
qa: -0.1118 -0.4368 -0.1357 -0.0481 -0.1148 -0.0906 -0.0762 0.3036 -0.2564 -0.2569 -0.1030 0.0552 -0.1894 -0.1554 -0.1120 -0.1154 -0.1404 0.0985 0.0799 0.0889 0.1033 0.0808 0.0539 0.0643 0.0673 0.0830 0.0870 0.0697 0.0730 0.0882 0.0827 0.1279 0.1284 0.1037 0.1347 0.1222 0.1238 0.1229
va: 2.3127 2.0607 3.1859 3.8618 3.9112 3.8522 3.8142 4.2573 3.9553 3.9556 3.8249 3.6242 4.0475 3.9776 3.9520 3.9525 3.9691 1.0186 1.0051 1.0053 1.0159 1.0206 1.0133 1.0146 1.0321 1.0035 1.0052 1.0029 1.0030 1.0055 1.0044 1.0039 1.0322 1.0133 1.0225 1.0005 1.0010 1.0001
dispcorr: -0.015910868 hartree
energy: -1074.419970620728
dipole: -22.10772 21.29298 -0.81474 4.08378 -4.45064 -0.36686 3.52819 -3.15542 0.37277
magnitude: 0.96816 au
magnitude: 2.46087 debye
