program: Orca
programVersion: 5.0.2
elementType: S O N C C C C C C C C C C C C C C H H H H H H H H H H H H H H H H H H H H H
charge: 0
multiplicity: 1
keywords: wb97x-d3
keywords: def2-TZVPP
keywords: def2/J RIJCOSX
keywords: DEFGRID2
keywords: scfconv7
keywords: smallprint printgap noloewdin
keywords: NOSOSCF
formula: C14H21NOS
InChI: InChI=1/C14H21NOS/c1-3-10-15(11-4-2)14(16)17-12-13-8-6-5-7-9-13/h5-9H,3-4,10-12H2,1-2H3
38 atoms
S  -0.222599 -1.652449 0.360729
O  -0.482376 0.603977 1.689804
N  -1.962507 0.345461 -0.005811
C  -2.566264 1.646647 0.247184
C  -2.49876 -0.409478 -1.122129
C  -2.062488 2.73981 -0.691281
C  -3.810591 -1.126402 -0.81279
C  -0.926115 -0.045545 0.771344
C  -0.563406 2.988781 -0.614385
C  -3.710887 -2.154712 0.302598
C  1.361429 -1.497305 1.242325
C  2.360833 -0.677526 0.483811
C  3.04549 -1.232614 -0.594114
C  2.608266 0.64802 0.824462
C  3.956387 -0.481721 -1.317724
C  3.518576 1.402772 0.097954
C  4.194294 0.841957 -0.97413
H  -2.373339 1.924135 1.28162
H  -3.649533 1.545224 0.143886
H  -1.752677 -1.124602 -1.470452
H  -2.651636 0.28205 -1.95504
H  -2.344341 2.505131 -1.72221
H  -2.604194 3.655933 -0.44009
H  -4.583042 -0.391813 -0.567939
H  -4.144045 -1.608996 -1.735305
H  -0.278592 3.815841 -1.265031
H  -0.251574 3.23549 0.399878
H  0.010898 2.117362 -0.928654
H  -2.987282 -2.935138 0.066583
H  -3.404949 -1.698904 1.244294
H  -4.674114 -2.635956 0.471822
H  1.167567 -1.098137 2.236032
H  1.704989 -2.526359 1.358158
H  2.858978 -2.263393 -0.872513
H  2.077036 1.093392 1.654305
H  4.482966 -0.929266 -2.150468
H  3.699055 2.433615 0.373547
H  4.905219 1.431056 -1.53834
totalener: -1074.40228665 hartree
nucrepener: 1379.00410107 hartree
electener: -2453.40638772 hartree
oneelecener: -4206.21651444 hartree
twoeener: 1752.81012672 hartree
kineticenergy: 1070.59192275 hartree
xcener: -87.044457746577 hartree
chargesum: -0.0000000
charge: -0.111713 -0.420816 -0.128840 -0.068561 -0.109017 -0.107210 -0.077539 0.280481 -0.235353 -0.267681 -0.100261 0.062694 -0.184828 -0.171671 -0.115749 -0.108897 -0.137274 0.105868 0.094538 0.105447 0.097251 0.050761 0.064894 0.053672 0.065461 0.087556 0.087209 0.071981 0.083079 0.087797 0.090506 0.127370 0.128385 0.104302 0.127761 0.122009 0.123526 0.122863
qa: -0.1117 -0.4208 -0.1288 -0.0686 -0.1090 -0.1072 -0.0775 0.2805 -0.2354 -0.2677 -0.1003 0.0627 -0.1848 -0.1717 -0.1157 -0.1089 -0.1373 0.1059 0.0945 0.1054 0.0973 0.0508 0.0649 0.0537 0.0655 0.0876 0.0872 0.0720 0.0831 0.0878 0.0905 0.1274 0.1284 0.1043 0.1278 0.1220 0.1235 0.1229
va: 2.3110 2.0777 3.1076 3.8607 3.8952 3.9001 3.8410 4.2807 3.9315 3.9427 3.8377 3.5826 4.0422 3.9591 3.9564 3.9296 3.9666 1.0250 1.0011 1.0278 1.0047 1.0089 1.0139 1.0088 1.0157 1.0064 1.0083 1.0060 1.0039 1.0044 1.0080 1.0321 1.0026 1.0148 1.0236 1.0004 1.0007 0.9999
dispcorr: -0.018456534 hartree
energy: -1074.420743184647
dipole: -14.02129 13.40113 -0.62015 6.45177 -6.44300 0.00877 -5.62694 4.85913 -0.76781
magnitude: 0.98701 au
magnitude: 2.50879 debye
