program: Orca
programVersion: 5.0.2
elementType: S O N C C C C C C C C C C C C C C H H H H H H H H H H H H H H H H H H H H H
charge: 0
multiplicity: 1
keywords: wb97x-d3
keywords: def2-TZVPP
keywords: def2/J RIJCOSX
keywords: DEFGRID2
keywords: scfconv7
keywords: smallprint printgap noloewdin
keywords: NOSOSCF
formula: C14H21NOS
InChI: InChI=1/C14H21NOS/c1-3-10-15(11-4-2)14(16)17-12-13-8-6-5-7-9-13/h5-9H,3-4,10-12H2,1-2H3
38 atoms
S  -0.279141 -1.487113 -1.547225
O  -0.335602 1.141986 -1.666472
N  -2.042273 0.239819 -0.496847
C  -2.59117 1.56744 -0.252874
C  -2.709276 -0.893425 0.116019
C  -1.865961 2.374359 0.819878
C  -2.491968 -1.010351 1.622194
C  -0.905912 0.171653 -1.224233
C  -2.483915 3.755848 0.980248
C  -1.034275 -1.155853 2.032592
C  1.450398 -1.051209 -1.903046
C  2.204537 -0.698423 -0.656143
C  2.548194 -1.690099 0.259587
C  2.548874 0.619238 -0.377482
C  3.220927 -1.373992 1.427251
C  3.223174 0.938248 0.79355
C  3.559351 -0.054784 1.699205
H  -3.638491 1.434794 0.030303
H  -2.588928 2.128177 -1.189686
H  -2.388237 -1.815118 -0.36822
H  -3.778628 -0.806204 -0.09519
H  -1.898807 1.84121 1.772862
H  -0.813767 2.469475 0.55005
H  -2.939235 -0.149432 2.126995
H  -3.061601 -1.879318 1.963232
H  -1.971595 4.328808 1.752523
H  -2.421611 4.327472 0.053134
H  -3.537035 3.697282 1.261893
H  -0.575821 -2.034054 1.578857
H  -0.436351 -0.294197 1.734724
H  -0.94679 -1.254318 3.114631
H  1.862482 -1.943881 -2.376451
H  1.466977 -0.247116 -2.636112
H  2.275669 -2.719858 0.059131
H  2.278392 1.400315 -1.075053
H  3.480881 -2.156533 2.128095
H  3.482767 1.968904 0.997601
H  4.08346 0.194902 2.612437
totalener: -1074.40192128 hartree
nucrepener: 1392.92332056 hartree
electener: -2467.32524183 hartree
oneelecener: -4234.01862605 hartree
twoeener: 1766.69338422 hartree
kineticenergy: 1070.58711966 hartree
xcener: -87.042135202987 hartree
chargesum: 0.0000000
charge: -0.122675 -0.420280 -0.131309 -0.069926 -0.109519 -0.079328 -0.090375 0.293204 -0.262596 -0.250760 -0.089866 0.053759 -0.211158 -0.147082 -0.101797 -0.112950 -0.138598 0.085517 0.101598 0.103991 0.092499 0.052391 0.083086 0.064977 0.070559 0.087063 0.083450 0.070346 0.079786 0.074797 0.091961 0.128140 0.124088 0.105505 0.122027 0.122130 0.123811 0.123530
qa: -0.1227 -0.4203 -0.1313 -0.0699 -0.1095 -0.0793 -0.0904 0.2932 -0.2626 -0.2508 -0.0899 0.0538 -0.2112 -0.1471 -0.1018 -0.1129 -0.1386 0.0855 0.1016 0.1040 0.0925 0.0524 0.0831 0.0650 0.0706 0.0871 0.0835 0.0703 0.0798 0.0748 0.0920 0.1281 0.1241 0.1055 0.1220 0.1221 0.1238 0.1235
va: 2.2941 2.0852 3.1343 3.8709 3.9495 3.8361 3.8246 4.2765 3.9679 3.9454 3.8481 3.5804 4.0058 3.9646 3.9360 3.9458 3.9675 1.0007 1.0154 1.0093 1.0064 1.0094 1.0210 1.0029 1.0165 1.0048 1.0030 1.0026 1.0105 1.0047 1.0080 1.0029 1.0324 1.0171 1.0233 1.0000 1.0004 0.9997
dispcorr: -0.019322012 hartree
energy: -1074.421243289443
dipole: -11.40986 10.82720 -0.58266 7.98746 -8.27195 -0.28449 13.54098 -12.78540 0.75558
magnitude: 0.99566 au
magnitude: 2.53076 debye
