program: Orca
programVersion: 5.0.2
elementType: S O N C C C C C C C C C C C C C C H H H H H H H H H H H H H H H H H H H H H
charge: 0
multiplicity: 1
keywords: wb97x-d3
keywords: def2-TZVPP
keywords: def2/J RIJCOSX
keywords: DEFGRID2
keywords: scfconv7
keywords: smallprint printgap noloewdin
keywords: NOSOSCF
formula: C14H21NOS
InChI: InChI=1/C14H21NOS/c1-3-10-15(11-4-2)14(16)17-12-13-8-6-5-7-9-13/h5-9H,3-4,10-12H2,1-2H3
38 atoms
S  -0.273214 -1.458295 -1.546126
O  -0.343204 1.172846 -1.630523
N  -2.057013 0.242667 -0.492499
C  -2.625399 1.561736 -0.245876
C  -2.711749 -0.903307 0.110293
C  -1.923277 2.372551 0.83909
C  -2.489101 -1.035098 1.614499
C  -0.911089 0.19294 -1.206733
C  -2.560902 3.74549 0.996667
C  -1.028219 -1.164816 2.018202
C  1.451348 -1.008855 -1.905966
C  2.218979 -0.681824 -0.660237
C  2.582569 -1.693572 0.225184
C  2.562296 0.630201 -0.355309
C  3.276988 -1.403044 1.386847
C  3.258853 0.923513 0.809364
C  3.617485 -0.08969 1.683392
H  -3.673815 1.413457 0.024997
H  -2.620441 2.127839 -1.179352
H  -2.384819 -1.816607 -0.385871
H  -3.782513 -0.822593 -0.09609
H  -1.960888 1.8352 1.789612
H  -0.869368 2.482481 0.582181
H  -2.946301 -0.185972 2.130063
H  -3.045644 -1.915658 1.947215
H  -2.497778 4.319427 0.071094
H  -3.615533 3.672851 1.268696
H  -2.062835 4.323638 1.77423
H  -0.55877 -2.031605 1.554344
H  -0.4433 -0.291791 1.728003
H  -0.936277 -1.273059 3.098905
H  1.862272 -1.889464 -2.402604
H  1.459343 -0.18879 -2.621512
H  2.310679 -2.719453 0.004845
H  2.275298 1.426815 -1.028184
H  3.553751 -2.201331 2.062978
H  3.518923 1.949883 1.033418
H  4.160273 0.13982 2.591059
totalener: -1074.40201433 hartree
nucrepener: 1390.70447744 hartree
electener: -2465.10649177 hartree
oneelecener: -4229.58035523 hartree
twoeener: 1764.47386346 hartree
kineticenergy: 1070.58861710 hartree
xcener: -87.042414658377 hartree
chargesum: -0.0000000
charge: -0.122489 -0.420410 -0.132048 -0.069123 -0.108391 -0.080258 -0.091384 0.293150 -0.262354 -0.250939 -0.090271 0.052646 -0.209981 -0.147099 -0.101985 -0.113027 -0.138914 0.085258 0.101342 0.104308 0.091874 0.052699 0.083398 0.065272 0.070405 0.083274 0.070391 0.087135 0.079876 0.075587 0.091708 0.128404 0.124428 0.105210 0.122692 0.122350 0.123670 0.123592
qa: -0.1225 -0.4204 -0.1320 -0.0691 -0.1084 -0.0803 -0.0914 0.2931 -0.2624 -0.2509 -0.0903 0.0526 -0.2100 -0.1471 -0.1020 -0.1130 -0.1389 0.0853 0.1013 0.1043 0.0919 0.0527 0.0834 0.0653 0.0704 0.0833 0.0704 0.0871 0.0799 0.0756 0.0917 0.1284 0.1244 0.1052 0.1227 0.1224 0.1237 0.1236
va: 2.2953 2.0848 3.1353 3.8714 3.9481 3.8359 3.8244 4.2764 3.9674 3.9457 3.8453 3.5812 4.0068 3.9646 3.9378 3.9465 3.9687 1.0009 1.0151 1.0090 1.0068 1.0094 1.0212 1.0029 1.0166 1.0030 1.0026 1.0048 1.0107 1.0048 1.0082 1.0029 1.0325 1.0170 1.0231 0.9999 1.0004 0.9997
dispcorr: -0.019200761 hartree
energy: -1074.421215087969
dipole: -11.60702 11.02086 -0.58617 7.80521 -8.10429 -0.29908 13.47363 -12.73462 0.73901
magnitude: 0.98953 au
magnitude: 2.51519 debye
