program: Orca
programVersion: 5.0.2
elementType: S O N C C C C C C C C C C C C C C H H H H H H H H H H H H H H H H H H H H H
charge: 0
multiplicity: 1
keywords: wb97x-d3
keywords: def2-TZVPP
keywords: def2/J RIJCOSX
keywords: DEFGRID2
keywords: scfconv7
keywords: smallprint printgap noloewdin
keywords: NOSOSCF
formula: C14H21NOS
InChI: InChI=1/C14H21NOS/c1-3-10-15(11-4-2)14(16)17-12-13-8-6-5-7-9-13/h5-9H,3-4,10-12H2,1-2H3
38 atoms
S  -0.160534 -1.512354 1.363272
O  -0.277365 1.110825 1.592119
N  -2.093905 0.182042 0.624558
C  -2.728061 1.489223 0.518655
C  -2.804218 -0.960559 0.083277
C  -2.206411 2.367415 -0.614307
C  -2.813085 -1.028124 -1.441241
C  -0.86798 0.134409 1.191785
C  -2.931502 3.704957 -0.650313
C  -1.42649 -1.094198 -2.063257
C  1.548063 -1.048105 1.772109
C  2.34023 -0.645249 0.56482
C  2.751539 -1.606007 -0.35571
C  2.670266 0.685556 0.337255
C  3.479831 -1.247346 -1.477043
C  3.401903 1.046841 -0.785844
C  3.807694 0.084148 -1.695854
H  -2.61246 2.016913 1.467523
H  -3.798993 1.315205 0.386347
H  -3.831651 -0.924826 0.456255
H  -2.380021 -1.88137 0.483633
H  -1.13626 2.529019 -0.48097
H  -2.330054 1.854153 -1.57059
H  -3.390341 -1.913127 -1.722572
H  -3.365547 -0.175023 -1.845265
H  -2.794374 4.255414 0.281666
H  -2.560229 4.333616 -1.458816
H  -4.004996 3.577061 -0.80226
H  -0.839614 -0.202502 -1.8427
H  -0.861605 -1.949046 -1.692547
H  -1.493651 -1.181059 -3.147555
H  1.527599 -0.266375 2.52901
H  1.965314 -1.945175 2.232742
H  2.493058 -2.646205 -0.194332
H  2.346439 1.442991 1.038122
H  3.794375 -2.006769 -2.180898
H  3.652013 2.087017 -0.94906
H  4.377919 0.367096 -2.570911
totalener: -1074.40282402 hartree
nucrepener: 1376.26504278 hartree
electener: -2450.66786681 hartree
oneelecener: -4200.70596316 hartree
twoeener: 1750.03809635 hartree
kineticenergy: 1070.58892275 hartree
xcener: -87.042580448992 hartree
chargesum: 0.0000000
charge: -0.122189 -0.425189 -0.131446 -0.067097 -0.112190 -0.085017 -0.090447 0.298348 -0.260928 -0.257594 -0.088896 0.048567 -0.197221 -0.141708 -0.107901 -0.115994 -0.139708 0.101146 0.084847 0.091420 0.103699 0.086090 0.051485 0.070997 0.065080 0.082529 0.087686 0.069836 0.080794 0.082838 0.091379 0.123313 0.129946 0.103915 0.120910 0.121953 0.123407 0.123337
qa: -0.1222 -0.4252 -0.1314 -0.0671 -0.1122 -0.0850 -0.0904 0.2983 -0.2609 -0.2576 -0.0889 0.0486 -0.1972 -0.1417 -0.1079 -0.1160 -0.1397 0.1011 0.0848 0.0914 0.1037 0.0861 0.0515 0.0710 0.0651 0.0825 0.0877 0.0698 0.0808 0.0828 0.0914 0.1233 0.1299 0.1039 0.1209 0.1220 0.1234 0.1233
va: 2.3052 2.0782 3.1352 3.8661 3.9494 3.8396 3.8165 4.2686 3.9654 3.9456 3.8392 3.5955 4.0193 3.9718 3.9505 3.9491 3.9688 1.0166 1.0005 1.0069 1.0099 1.0203 1.0100 1.0166 1.0030 1.0032 1.0049 1.0026 1.0053 1.0106 1.0072 1.0335 1.0027 1.0166 1.0242 1.0001 1.0005 0.9999
dispcorr: -0.018221264 hartree
energy: -1074.421045288232
dipole: -14.03195 13.33427 -0.69769 7.95980 -8.24851 -0.28871 -11.72656 11.13230 -0.59426
magnitude: 0.96087 au
magnitude: 2.44234 debye
