program: Orca
programVersion: 5.0.2
elementType: S O N C C C C C C C C C C C C C C H H H H H H H H H H H H H H H H H H H H H
charge: 0
multiplicity: 1
keywords: wb97x-d3
keywords: def2-TZVPP
keywords: def2/J RIJCOSX
keywords: DEFGRID2
keywords: scfconv7
keywords: smallprint printgap noloewdin
keywords: NOSOSCF
formula: C14H21NOS
InChI: InChI=1/C14H21NOS/c1-3-10-15(11-4-2)14(16)17-12-13-8-6-5-7-9-13/h5-9H,3-4,10-12H2,1-2H3
38 atoms
S  -0.203296 -1.631142 0.877394
O  -0.241768 -0.734464 -1.594896
N  -1.854672 0.13273 -0.253889
C  -2.311364 1.051779 -1.287978
C  -2.494027 0.206034 1.04829
C  -1.775609 2.46997 -1.105872
C  -3.478174 -0.927146 1.32721
C  -0.791381 -0.658717 -0.521739
C  -0.256731 2.57077 -1.114527
C  -4.601594 -1.026083 0.307373
C  1.467078 -1.987378 0.256184
C  2.33062 -0.761972 0.204908
C  2.77863 -0.25991 -1.010438
C  2.679684 -0.096274 1.377357
C  3.563541 0.883929 -1.05471
C  3.46122 1.045778 1.335554
C  3.904928 1.541182 0.116302
H  -3.403479 1.063915 -1.277535
H  -2.007965 0.658466 -2.256428
H  -3.022401 1.16052 1.092022
H  -1.736574 0.247926 1.834526
H  -2.194347 3.081177 -1.910377
H  -2.16674 2.896908 -0.176895
H  -2.942732 -1.878232 1.376982
H  -3.894374 -0.764641 2.324956
H  0.059322 3.611728 -1.04395
H  0.19334 2.040338 -0.274715
H  0.169195 2.151356 -2.025352
H  -4.217642 -1.245841 -0.689169
H  -5.296099 -1.824063 0.569302
H  -5.176099 -0.099287 0.249234
H  1.861094 -2.720883 0.962285
H  1.390233 -2.472059 -0.715328
H  2.497752 -0.757263 -1.92897
H  2.323634 -0.469988 2.330424
H  3.900536 1.26547 -2.009756
H  3.724047 1.552129 2.255266
H  4.513035 2.435612 0.08177
totalener: -1074.40120913 hartree
nucrepener: 1391.86370092 hartree
electener: -2466.26491005 hartree
oneelecener: -4231.99542759 hartree
twoeener: 1765.73051754 hartree
kineticenergy: 1070.59286113 hartree
xcener: -87.043503018403 hartree
chargesum: 0.0000000
charge: -0.118622 -0.412618 -0.131511 -0.080638 -0.120187 -0.101121 -0.088553 0.286916 -0.226605 -0.262119 -0.086671 0.035738 -0.127569 -0.179590 -0.122414 -0.117760 -0.132214 0.098235 0.108549 0.094584 0.112757 0.065889 0.049448 0.069928 0.064826 0.086800 0.064607 0.087018 0.083333 0.093753 0.075192 0.130010 0.117959 0.112374 0.103860 0.121721 0.122148 0.122545
qa: -0.1186 -0.4126 -0.1315 -0.0806 -0.1202 -0.1011 -0.0886 0.2869 -0.2266 -0.2621 -0.0867 0.0357 -0.1276 -0.1796 -0.1224 -0.1178 -0.1322 0.0982 0.1085 0.0946 0.1128 0.0659 0.0494 0.0699 0.0648 0.0868 0.0646 0.0870 0.0833 0.0938 0.0752 0.1300 0.1180 0.1124 0.1039 0.1217 0.1221 0.1225
va: 2.3065 2.0956 3.0657 3.8549 3.8854 3.9056 3.8533 4.2927 3.9276 3.9209 3.8560 3.5969 3.9542 4.0111 3.9436 3.9552 3.9583 0.9979 1.0245 0.9986 1.0220 1.0145 1.0109 1.0239 1.0173 1.0069 1.0072 1.0094 1.0044 1.0099 1.0000 1.0019 1.0329 1.0247 1.0214 1.0012 1.0006 1.0000
dispcorr: -0.019089385 hartree
energy: -1074.420298518106
dipole: -14.62596 13.99854 -0.62742 9.63085 -9.13567 0.49517 -0.91988 1.45533 0.53545
magnitude: 0.96206 au
magnitude: 2.44536 debye
